{"text_format":"1","workbook":"xlsx","n_sheets":5,"sheets":["INFOS","Prépa","Particip","Donnees","Cl.J1+Gen."],"not_rendered":{"charts":0,"images":1,"macros":1,"external_links":0,"defined_names":7,"comments":0,"pivot_tables":0},"unopened":[],"bounds":{"document_bytes":16777216,"sheet_cells":100000,"rows_first":2000,"rows_last":500,"rows_between":2000,"halvings":0,"cell_chars":16384,"cell_head_chars":4096},"cells_cut":0,"cells_raw":0,"read":"whole","date_system":"1900"}

{"sheet":"INFOS","index":0,"n_rows":11,"n_cols":2,"rows_kept":11,"cut":false,"hidden":false,"merged":[[10,1,10,10],[0,1,0,10],[2,1,2,10],[4,1,4,10],[6,1,6,2]]}
[null,"CE PETIT PROGRAMME EST FAIT POUR VOUS FACILITER LA GESTION DES INTERCLUBS PAR EQUIPES PROMOTION MID AMATEURS DAMES SELON LA FORME DE JEU PRECONISEE PAR LA FFGOLF"]
[]
[null,"AVANT TOUTES CHOSES, IL VOUS FAUT ACTUALISER LES TABLEAUX DES PAGES SUIVANTES COMME-SUIT:"]
[]
["1:","EN FONCTION DU NOMBRE D'EQUIPES INSCRITES ( DE 4 A 24 POSSIBLES), CLIQUEZ SUR LE BOUTON CORRESPONDANT CI-DESSOUS. SI LE PROGRAMME VOUS DEMANDE UN MOT DE PASSE, TAPER: JBDB EN LETTRES MAJUSCULES."]
[]
[null,"Nombre d'équipes:"]
[]
[]
[]
["2:","UNE FOIS QUE VOS TABLEAUX SONT ADAPTES AU NOMBRE D'EQUIPES PARTICIPANTES ET AU NOMBRE D'EQUIPES QUALIFIEES, COPIEZ CE FICHIER SUR LE DISQUE DUR. ATTENTION: SI VOUS CHANGEZ LE NOM DE CE FICHIER, LES MACROS AFFECTEES AUX BOUTONS CI-DESSUS AINSI QUE LES CLASSEMENTS NE FONCTIONNERONT PLUS. VOUS POUVEZ FAIRE DES SAUVEGARDES SUR DISQUETTE  AU FUR ET A MESURE QUE LA COMPETITION AVANCE. POUR PALLIER UNE PANNE TOTALE D'INFORMATIQUE PENDANT LA COMPETITION, IMPRIMEZ TOUTES LES FEUILLES VIERGES POUR POUVOIR, LE CAS ECHEANT, TRAVAILLER EN MANUEL."]

{"sheet":"Prépa","index":1,"n_rows":61,"n_cols":5,"rows_kept":61,"cut":false,"hidden":false,"merged":[[0,0,0,7],[12,3,12,5],[14,3,14,5],[16,3,16,5],[20,3,20,5],[18,3,18,5],[10,3,10,5],[1,3,1,7],[3,3,3,7],[5,3,5,7],[22,3,22,5],[28,3,28,5],[34,3,34,5],[32,3,32,5],[30,3,30,5],[48,3,48,5],[44,3,44,5],[46,3,46,5],[24,3,24,5],[26,3,26,5],[36,3,36,5],[38,3,38,5],[40,3,40,5],[42,3,42,5],[63,3,63,5],[65,3,65,5],[50,3,50,5],[54,3,54,5],[60,3,60,5],[58,3,58,5],[56,3,56,5],[52,3,52,5]]}
["REMPLIR CETTE FEUILLE AVEC LE TITRE DE LA COMPETITION ET LE NOM DES CLUBS PARTICIPANT DE PREFERENCE DANS L'ORDRE DES DEPARTS OU PAR ORDRE ALPHABETIQUE.LES FEUILLES SONT PROTEGEES, EN CAS DE BESOIN UTILISER: JBDB "]
["TITRE DE LA COMPETITION :",null,null,"INTERCLUBS PAR EQUIPES PROMOTION MID DAMES"]
[]
["Sous TITRE DE LA COMPETITION :",null,null,"Inter régions  OUEST"]
[]
["Date et Lieu :",null,null,"19 et 20 juin 2021 au Golf de Saint Cast"]
[]
["Nombre d'équipes montant en 3ème Division:",null,null,null,3]
[]
[]
["NOM DES CLUBS :",null,1,"BAUGE"]
[]
[null,null,2,"BOIS D'O"]
[]
[null,null,3,"CH. CHEVERNY"]
[]
[null,null,4,"CHARTRES FONTENAY"]
[]
[null,null,5,"CHOLET"]
[]
[null,null,6,"GLORIETTE"]
[]
[null,null,7,"LAC AU DUC"]
[]
[null,null,8,"LAVAL"]
[]
[null,null,9,"NANTES ERDRE"]
[]
[null,null,10,"ORLEANS DONNERY"]
[]
[null,null,11,"PLENEUF VAL ANDRE"]
[]
[null,null,12,"SABLES D'OR"]
[]
[null,null,13,"SAINT CAST"]
[]
[null,null,14,"SAVENAY"]
[]
[null,null,15]
[]
[null,null,16]
[]
[null,null,17]
[]
[null,null,18]
[]
[null,null,19]
[]
[null,null,20]
[]
[null,null,21]
[]
[null,null,22]
[]
[null,null,23]
[]
[null,null,24]
[]
[null,null,25]
[]
[null,null,26]

{"sheet":"Particip","index":2,"n_rows":599,"n_cols":8,"rows_kept":599,"cut":false,"hidden":false,"merged":[[42,6,42,7],[41,2,41,6],[42,0,42,5],[69,3,69,6],[78,0,78,3],[72,0,72,7],[74,0,74,7],[56,2,56,3],[60,2,60,6],[46,0,46,1],[44,3,44,7],[49,0,49,7],[59,2,59,6],[65,0,65,5],[67,0,67,2],[67,3,67,7],[77,0,77,7],[73,0,73,7],[69,0,69,1],[46,3,46,6],[65,6,65,7],[61,2,61,6],[43,0,43,7],[66,0,66,7],[36,2,36,6],[40,2,40,6],[37,2,37,6],[38,2,38,6],[39,2,39,6],[3,0,3,7],[5,0,5,7],[4,0,4,7],[18,2,18,6],[9,0,9,3],[34,2,34,6],[26,0,26,7],[32,0,32,3],[32,4,32,7],[33,2,33,3],[19,6,19,7],[19,0,19,5],[0,0,1,6],[62,2,62,6],[58,2,58,6],[13,2,13,6],[14,2,14,6],[44,0,44,2],[15,2,15,6],[16,2,16,6],[55,0,55,3],[8,0,8,7],[9,4,9,7],[10,2,10,3],[11,2,11,6],[12,2,12,6],[17,2,17,6],[35,2,35,6],[31,0,31,7],[20,0,20,7],[23,0,23,1],[23,3,23,6],[21,0,21,2],[21,3,21,7],[28,0,28,7],[27,0,27,7],[109,2,109,6],[78,4,78,7],[80,2,80,6],[81,2,81,6],[82,2,82,6],[103,2,103,6],[104,2,104,6],[102,2,102,3],[85,2,85,6],[86,2,86,6],[105,2,105,6],[106,2,106,6],[107,2,107,6],[92,3,92,6],[88,6,88,7],[101,4,101,7],[101,0,101,3],[108,2,108,6],[79,2,79,3],[87,2,87,6],[96,0,96,7],[95,0,95,7],[97,0,97,7],[83,2,83,6],[134,0,134,5],[115,0,115,1],[115,3,115,6],[112,0,112,7],[113,0,113,2],[113,3,113,7],[110,2,110,6],[111,6,111,7],[111,0,111,5],[125,2,125,3],[152,2,152,6],[153,2,153,6],[154,2,154,6],[141,0,141,7],[150,2,150,6],[151,2,151,6],[146,0,146,7],[147,0,147,3],[147,4,147,7],[148,2,148,3],[143,0,143,7],[149,2,149,6],[159,3,159,7],[156,2,156,6],[157,0,157,5],[157,6,157,7],[158,0,158,7],[174,2,174,6],[181,0,181,7],[182,0,182,2],[176,2,176,6],[177,2,177,6],[178,2,178,6],[180,0,180,5],[164,0,164,7],[166,0,166,7],[165,0,165,7],[161,0,161,1],[171,2,171,3],[172,2,172,6],[51,0,51,7],[50,0,50,7],[55,4,55,7],[193,4,193,7],[194,2,194,3],[161,3,161,6],[169,0,169,7],[170,0,170,3],[170,4,170,7],[92,0,92,1],[89,0,89,7],[90,0,90,2],[90,3,90,7],[88,0,88,5],[100,0,100,7],[127,2,127,6],[142,0,142,7],[180,6,180,7],[182,3,182,7],[155,2,155,6],[159,0,159,2],[175,2,175,6],[173,2,173,6],[179,2,179,6],[199,2,199,6],[184,0,184,1],[184,3,184,6],[187,0,187,7],[197,2,197,6],[192,0,192,7],[189,0,189,7],[200,2,200,6],[188,0,188,7],[195,2,195,6],[196,2,196,6],[193,0,193,3],[198,2,198,6],[311,2,311,6],[218,2,218,6],[215,0,215,7],[216,0,216,3],[216,4,216,7],[217,2,217,3],[212,0,212,7],[211,0,211,7],[250,0,250,7],[243,2,243,6],[240,2,240,3],[238,0,238,7],[239,0,239,3],[239,4,239,7],[248,2,248,6],[244,2,244,6],[245,2,245,6],[246,2,246,6],[247,2,247,6],[234,0,234,7],[235,0,235,7],[241,2,241,6],[242,2,242,6],[227,0,227,7],[312,2,312,6],[296,0,296,7],[285,4,285,7],[281,0,281,7],[289,2,289,6],[294,2,294,6],[318,0,318,5],[297,0,297,2],[297,3,297,7],[299,0,299,1],[299,3,299,6],[309,2,309,3],[316,2,316,6],[307,0,307,7],[308,0,308,3],[308,4,308,7],[288,2,288,6],[295,0,295,5],[290,2,290,6],[291,2,291,6],[292,2,292,6],[293,2,293,6],[295,6,295,7],[310,2,310,6],[327,0,327,7],[326,0,326,7],[317,2,317,6],[320,0,320,2],[320,3,320,7],[322,0,322,1],[322,3,322,6],[319,0,319,7],[325,0,325,7],[337,2,337,6],[338,2,338,6],[339,2,339,6],[336,2,336,6],[330,0,330,7],[331,0,331,3],[331,4,331,7],[332,2,332,3],[333,2,333,6],[334,2,334,6],[335,2,335,6],[340,2,340,6],[343,0,343,2],[343,3,343,7],[345,0,345,1],[349,0,349,7],[348,0,348,7],[345,3,345,6],[341,0,341,5],[341,6,341,7],[342,0,342,7],[303,0,303,7],[302,0,302,7],[274,0,274,2],[249,0,249,5],[249,6,249,7],[264,2,264,6],[265,2,265,6],[251,0,251,2],[251,3,251,7],[253,0,253,1],[253,3,253,6],[263,2,263,3],[261,0,261,7],[262,0,262,3],[262,4,262,7],[266,2,266,6],[268,2,268,6],[267,2,267,6],[258,0,258,7],[257,0,257,7],[256,0,256,7],[280,0,280,7],[276,0,276,1],[276,3,276,6],[368,0,368,1],[368,3,368,6],[366,3,366,7],[286,2,286,3],[284,0,284,7],[279,0,279,7],[285,0,285,3],[287,2,287,6],[358,2,358,6],[359,2,359,6],[360,2,360,6],[355,2,355,3],[364,0,364,5],[364,6,364,7],[365,0,365,7],[366,0,366,2],[362,2,362,6],[356,2,356,6],[357,2,357,6],[318,6,318,7],[313,2,313,6],[314,2,314,6],[315,2,315,6],[304,0,304,7],[379,2,379,6],[380,2,380,6],[381,2,381,6],[382,2,382,6],[383,2,383,6],[384,2,384,6],[385,2,385,6],[378,2,378,3],[371,0,371,7],[376,0,376,7],[377,0,377,3],[377,4,377,7],[373,0,373,7],[372,0,372,7],[399,0,399,7],[396,0,396,7],[395,0,395,7],[394,0,394,7],[386,2,386,6],[387,0,387,5],[387,6,387,7],[391,0,391,1],[391,3,391,6],[388,0,388,7],[389,0,389,2],[389,3,389,7],[409,2,409,6],[410,0,410,5],[410,6,410,7],[400,0,400,3],[400,4,400,7],[401,2,401,3],[402,2,402,6],[403,2,403,6],[404,2,404,6],[405,2,405,6],[406,2,406,6],[407,2,407,6],[408,2,408,6],[422,0,422,7],[419,0,419,7],[418,0,418,7],[417,0,417,7],[411,0,411,7],[412,0,412,2],[412,3,412,7],[432,2,432,6],[433,0,433,5],[433,6,433,7],[423,0,423,3],[423,4,423,7],[424,2,424,3],[425,2,425,6],[426,2,426,6],[427,2,427,6],[428,2,428,6],[429,2,429,6],[430,2,430,6],[414,0,414,1],[414,3,414,6],[431,2,431,6],[445,0,445,7],[442,0,442,7],[441,0,441,7],[440,0,440,7],[434,0,434,7],[435,0,435,2],[435,3,435,7],[437,0,437,1],[437,3,437,6],[455,2,455,6],[456,0,456,5],[456,6,456,7],[446,0,446,3],[446,4,446,7],[447,2,447,3],[448,2,448,6],[449,2,449,6],[450,2,450,6],[451,2,451,6],[452,2,452,6],[453,2,453,6],[454,2,454,6],[468,0,468,7],[465,0,465,7],[464,0,464,7],[463,0,463,7],[457,0,457,7],[458,0,458,2],[458,3,458,7],[478,2,478,6],[479,0,479,5],[479,6,479,7],[469,0,469,3],[469,4,469,7],[470,2,470,3],[471,2,471,6],[472,2,472,6],[473,2,473,6],[474,2,474,6],[475,2,475,6],[476,2,476,6],[460,0,460,1],[460,3,460,6],[477,2,477,6],[491,0,491,7],[486,0,486,7],[487,0,487,7],[488,0,488,7],[480,0,480,7],[481,0,481,2],[481,3,481,7],[483,0,483,1],[483,3,483,6],[501,2,501,6],[502,0,502,5],[502,6,502,7],[492,0,492,3],[492,4,492,7],[493,2,493,3],[494,2,494,6],[495,2,495,6],[496,2,496,6],[497,2,497,6],[498,2,498,6],[499,2,499,6],[500,2,500,6],[514,0,514,7],[511,0,511,7],[510,0,510,7],[509,0,509,7],[503,0,503,7],[504,0,504,2],[504,3,504,7],[524,2,524,6],[525,0,525,5],[525,6,525,7],[515,0,515,3],[515,4,515,7],[516,2,516,3],[517,2,517,6],[518,2,518,6],[519,2,519,6],[520,2,520,6],[521,2,521,6],[522,2,522,6],[506,0,506,1],[506,3,506,6],[523,2,523,6],[537,0,537,7],[534,0,534,7],[533,0,533,7],[532,0,532,7],[526,0,526,7],[527,0,527,2],[527,3,527,7],[529,0,529,1],[529,3,529,6],[547,2,547,6],[548,0,548,5],[548,6,548,7],[538,0,538,3],[538,4,538,7],[539,2,539,3],[540,2,540,6],[541,2,541,6],[542,2,542,6],[543,2,543,6],[544,2,544,6],[545,2,545,6],[546,2,546,6],[560,0,560,7],[557,0,557,7],[556,0,556,7],[555,0,555,7],[549,0,549,7],[550,0,550,2],[550,3,550,7],[570,2,570,6],[571,0,571,5],[571,6,571,7],[561,0,561,3],[561,4,561,7],[562,2,562,3],[563,2,563,6],[564,2,564,6],[565,2,565,6],[566,2,566,6],[567,2,567,6],[568,2,568,6],[552,0,552,1],[552,3,552,6],[569,2,569,6],[583,0,583,7],[580,0,580,7],[579,0,579,7],[578,0,578,7],[572,0,572,7],[573,0,573,2],[573,3,573,7],[575,0,575,1],[575,3,575,6],[595,0,595,7],[596,0,596,2],[596,3,596,7],[598,0,598,1],[598,3,598,6],[350,0,350,7],[363,2,363,6],[354,0,354,3],[361,2,361,6],[353,0,353,7],[354,4,354,7],[593,2,593,6],[594,0,594,5],[594,6,594,7],[584,0,584,3],[584,4,584,7],[585,2,585,3],[586,2,586,6],[587,2,587,6],[588,2,588,6],[589,2,589,6],[590,2,590,6],[591,2,591,6],[592,2,592,6],[274,3,274,7],[272,0,272,5],[272,6,272,7],[273,0,273,7],[269,2,269,6],[270,2,270,6],[271,2,271,6],[219,2,219,6],[210,0,210,7],[233,0,233,7],[228,0,228,2],[228,3,228,7],[230,0,230,1],[230,3,230,6],[220,2,220,6],[221,2,221,6],[222,2,222,6],[226,0,226,5],[223,2,223,6],[224,2,224,6],[225,2,225,6],[226,6,226,7],[204,0,204,7],[201,2,201,6],[202,2,202,6],[203,0,203,5],[203,6,203,7],[205,0,205,2],[205,3,205,7],[207,0,207,1],[207,3,207,6],[84,2,84,6],[57,2,57,6],[54,0,54,7],[63,2,63,6],[64,2,64,6],[138,0,138,1],[138,3,138,6],[136,0,136,2],[136,3,136,7],[126,2,126,6],[118,0,118,7],[119,0,119,7],[124,0,124,3],[124,4,124,7],[123,0,123,7],[120,0,120,7],[134,6,134,7],[128,2,128,6],[129,2,129,6],[130,2,130,6],[131,2,131,6],[133,2,133,6],[135,0,135,7],[132,2,132,6]]}
["REMPLIR CETTE FEUILLE ( par ordre d'index) AVEC LES NOMS, PRENOMS DES JOUEURS ET LEUR INDEX AVEC DECIMALE, L'ARRONDI SE FAIT AUTOMATIQUEMENT   "]
[]
[]
[{"$f":"Prépa!$D$2","v":"INTERCLUBS PAR EQUIPES PROMOTION MID DAMES"}]
[{"$f":"Prépa!$D$4","v":"Inter régions  OUEST"}]
[{"$f":"Prépa!$D$6","v":"19 et 20 juin 2021 au Golf de Saint Cast"}]
[]
[]
["Fiche de composition d'Equipe"]
["Equipières du club de :",null,null,null,{"$f":"Prépa!$D$11","v":"BAUGE"}]
[null,"Ind","NOM",null,null,"Prénom",null,"Ind. Arr."]
[1,14.2,"L'HOSTIS Annie",null,null,null,null,{"$f":"IF(B12=\"\",\"\",B12)","v":14.2}]
[2,16.7,"CHAUVEL Yung",null,null,null,null,{"$f":"IF(B13=\"\",\"\",B13)","v":16.7}]
[3,21.5,"FRAPREAU Colette",null,null,null,null,21.5]
[4,21.6,"BESSONNEAU Nadine",null,null,null,null,21.6]
[5,22.5,"SOUEF Isabelle",null,null,null,null,22.5]
[6,22.9,"OUDIN Martine",null,null,null,null,22.9]
[7,24.7,"AINAULT Cecile",null,null,null,null,24.7]
[8,null,null,null,null,null,null,""]
["Personne autorisée à donner des conseils :"]
["Si cette personne n'est pas le capitaine, ce dernier ne pourra pas donner de conseils dans les conditions fixées par la note de la règle de golf n°8"]
["CAPITAINE :"]
[]
["DATE :",null,null,"Signature du Capitaine"]
[]
[]
[{"$f":"Prépa!$D$2","v":"INTERCLUBS PAR EQUIPES PROMOTION MID DAMES"}]
[{"$f":"Prépa!$D$4","v":"Inter régions  OUEST"}]
[{"$f":"Prépa!$D$6","v":"19 et 20 juin 2021 au Golf de Saint Cast"}]
[]
[]
["Fiche de composition d'Equipe"]
["Equipières du club de :",null,null,null,{"$f":"Prépa!$D$13","v":"BOIS D'O"}]
[null,"Ind","NOM",null,null,"Prénom",null,"Ind. Arr."]
[1,14,"CASTEL Stéfany",null,null,null,null,{"$f":"IF(B35=\"\",\"\",B35)","v":14}]
[2,17.7,"REGEON Catherine",null,null,null,null,{"$f":"IF(B36=\"\",\"\",B36)","v":17.7}]
[3,17.899999999999999,"HOUGUET Chantal",null,null,null,null,17.899999999999999]
[4,18.100000000000001,"BABILLIOT Marie- Catherine",null,null,null,null,18.100000000000001]
[5,19.399999999999999,"VECTEN Véronique",null,null,null,null,19.399999999999999]
[6,20.100000000000001,"POULLAIN Muriel",null,null,null,null,20.100000000000001]
[7,23.9,"JOSSE Marie-Chri",null,null,null,null,23.9]
[8,null,null,null,null,null,null,""]
["Personne autorisée à donner des conseils :"]
["Si cette personne n'est pas le capitaine, ce dernier ne pourra pas donner de conseils dans les conditions fixées par la note de la règle de golf n°8"]
["CAPITAINE :"]
[]
["DATE :",null,null,"Signature du Capitaine"]
[]
[]
[{"$f":"Prépa!$D$2","v":"INTERCLUBS PAR EQUIPES PROMOTION MID DAMES"}]
[{"$f":"Prépa!$D$4","v":"Inter régions  OUEST"}]
[{"$f":"Prépa!$D$6","v":"19 et 20 juin 2021 au Golf de Saint Cast"}]
[]
[]
["Fiche de composition d'Equipe"]
["Equipières du club de :",null,null,null,{"$f":"Prépa!$D$15","v":"CH. CHEVERNY"}]
[null,"Ind","NOM",null,null,"Prénom",null,"Ind. Arr."]
[1,8.8000000000000007,"LORILLOU Carole",null,null,null,null,{"$f":"IF(B58=\"\",\"\",B58)","v":8.8000000000000007}]
[2,11,"MARROCCO Maryline",null,null,null,null,{"$f":"IF(B59=\"\",\"\",B59)","v":11}]
[3,12.5,"BOURDEAU Josiane",null,null,null,null,12.5]
[4,13.5,"COUASSE Isabelle",null,null,null,null,13.5]
[5,15.7,"BERNON Patricia",null,null,null,null,15.7]
[6,17.8,"REVET Josiane",null,null,null,null,17.8]
[7,null,null,null,null,null,null,""]
[8,null,null,null,null,null,null,""]
["Personne autorisée à donner des conseils :"]
["Si cette personne n'est pas le capitaine, ce dernier ne pourra pas donner de conseils dans les conditions fixées par la note de la règle de golf n°8"]
["CAPITAINE :"]
[]
["DATE :",null,null,"Signature du Capitaine"]
[]
[]
[{"$f":"Prépa!$D$2","v":"INTERCLUBS PAR EQUIPES PROMOTION MID DAMES"}]
[{"$f":"Prépa!$D$4","v":"Inter régions  OUEST"}]
[{"$f":"Prépa!$D$6","v":"19 et 20 juin 2021 au Golf de Saint Cast"}]
[]
[]
["Fiche de composition d'Equipe"]
["Equipières du club de :",null,null,null,{"$f":"Prépa!$D$17","v":"CHARTRES FONTENAY"}]
[null,"Ind","NOM",null,null,"Prénom",null,"Ind. Arr."]
[1,3.6,"KACZMAREK Nathalie",null,null,null,null,{"$f":"IF(B81=\"\",\"\",B81)","v":3.6}]
[2,13.2,"DORISE Celine",null,null,null,null,{"$f":"IF(B82=\"\",\"\",B82)","v":13.2}]
[3,14.5,"TREMBLAY Fabienne",null,null,null,null,14.5]
[4,14.6,"SERINET Carole",null,null,null,null,14.6]
[5,25.7,"PASQUET Anne-Charlotte",null,null,null,null,25.7]
[6,28.2,"BESNARD Delphine",null,null,null,null,28.2]
[7,null,null,null,null,null,null,""]
[8,null,null,null,null,null,null,""]
["Personne autorisée à donner des conseils :"]
["Si cette personne n'est pas le capitaine, ce dernier ne pourra pas donner de conseils dans les conditions fixées par la note de la règle de golf n°8"]
["CAPITAINE :"]
[]
["DATE :",null,null,"Signature du Capitaine"]
[]
[]
[{"$f":"Prépa!$D$2","v":"INTERCLUBS PAR EQUIPES PROMOTION MID DAMES"}]
[{"$f":"Prépa!$D$4","v":"Inter régions  OUEST"}]
[{"$f":"Prépa!$D$6","v":"19 et 20 juin 2021 au Golf de Saint Cast"}]
[]
[]
["Fiche de composition d'Equipe"]
["Equipières du club de :",null,null,null,{"$f":"Prépa!$D$19","v":"CHOLET"}]
[null,"Ind","NOM",null,null,"Prénom",null,"Ind. Arr."]
[1,12,"CESBRON Annie",null,null,null,null,{"$f":"IF(B104=\"\",\"\",B104)","v":12}]
[2,12.7,"DEMARET Evelyne",null,null,null,null,{"$f":"IF(B105=\"\",\"\",B105)","v":12.7}]
[3,16.2,"ROUSSEAU Marie-Christine",null,null,null,null,16.2]
[4,17.5,"GRAVOUEILLE Chantal",null,null,null,null,17.5]
[5,18,"JULIENNE Virginie",null,null,null,null,18]
[6,18.7,"PETRELLA Anne",null,null,null,null,18.7]
[7,19,"BERARD Véronique",null,null,null,null,19]
[8,null,null,null,null,null,null,""]
["Personne autorisée à donner des conseils :"]
["Si cette personne n'est pas le capitaine, ce dernier ne pourra pas donner de conseils dans les conditions fixées par la note de la règle de golf n°8"]
["CAPITAINE :"]
[]
["DATE :",null,null,"Signature du Capitaine"]
[]
[]
[{"$f":"Prépa!$D$2","v":"INTERCLUBS PAR EQUIPES PROMOTION MID DAMES"}]
[{"$f":"Prépa!$D$4","v":"Inter régions  OUEST"}]
[{"$f":"Prépa!$D$6","v":"19 et 20 juin 2021 au Golf de Saint Cast"}]
[]
[]
["Fiche de composition d'Equipe"]
["Equipières du club de :",null,null,null,{"$f":"Prépa!$D$21","v":"GLORIETTE"}]
[null,"Ind","NOM",null,null,"Prénom",null,"Ind. Arr."]
[1,15.8,"MILLET Isabelle",null,null,null,null,{"$f":"IF(B127=\"\",\"\",B127)","v":15.8}]
[2,20.5,"GEORGE Catherine",null,null,null,null,{"$f":"IF(B128=\"\",\"\",B128)","v":20.5}]
[3,21.1,"NARDY Marie José",null,null,null,null,21.1]
[4,23.1,"CHAUSSONNIERE Catherine",null,null,null,null,23.1]
[5,23.8,"BARRON Nathalie",null,null,null,null,23.8]
[6,null,null,null,null,null,null,""]
[7,null,null,null,null,null,null,""]
[8,null,null,null,null,null,null,""]
["Personne autorisée à donner des conseils :"]
["Si cette personne n'est pas le capitaine, ce dernier ne pourra pas donner de conseils dans les conditions fixées par la note de la règle de golf n°8"]
["CAPITAINE :"]
[]
["DATE :",null,null,"Signature du Capitaine"]
[]
[]
[{"$f":"Prépa!$D$2","v":"INTERCLUBS PAR EQUIPES PROMOTION MID DAMES"}]
[{"$f":"Prépa!$D$4","v":"Inter régions  OUEST"}]
[{"$f":"Prépa!$D$6","v":"19 et 20 juin 2021 au Golf de Saint Cast"}]
[]
[]
["Fiche de composition d'Equipe"]
["Equipières du club de :",null,null,null,{"$f":"Prépa!$D$23","v":"LAC AU DUC"}]
[null,"Ind","NOM",null,null,"Prénom",null,"Ind. Arr."]
[1,4.9000000000000004,"URVOIS Christelle",null,null,null,null,{"$f":"IF(B150=\"\",\"\",B150)","v":4.9000000000000004}]
[2,10.3,"ECHELARD Sylvie",null,null,null,null,{"$f":"IF(B151=\"\",\"\",B151)","v":10.3}]
[3,12.5,"RIGUIDEL Annick",null,null,null,null,12.5]
[4,13.9,"LEGRAND Véronique",null,null,null,null,13.9]
[5,16.8,"VISSER Maryvonne",null,null,null,null,16.8]
[6,null,null,null,null,null,null,""]
[7,null,null,null,null,null,null,""]
[8,null,null,null,null,null,null,""]
["Personne autorisée à donner des conseils :"]
["Si cette personne n'est pas le capitaine, ce dernier ne pourra pas donner de conseils dans les conditions fixées par la note de la règle de golf n°8"]
["CAPITAINE :"]
[]
["DATE :",null,null,"Signature du Capitaine"]
[]
[]
[{"$f":"Prépa!$D$2","v":"INTERCLUBS PAR EQUIPES PROMOTION MID DAMES"}]
[{"$f":"Prépa!$D$4","v":"Inter régions  OUEST"}]
[{"$f":"Prépa!$D$6","v":"19 et 20 juin 2021 au Golf de Saint Cast"}]
[]
[]
["Fiche de composition d'Equipe"]
["Equipières du club de :",null,null,null,{"$f":"Prépa!$D$25","v":"LAVAL"}]
[null,"Ind","NOM",null,null,"Prénom",null,"Ind. Arr."]
[1,6.2,"NAIRIERE Dominique",null,null,null,null,{"$f":"IF(B173=\"\",\"\",B173)","v":6.2}]
[2,9.9,"RAIMBAULT Fabienne",null,null,null,null,{"$f":"IF(B174=\"\",\"\",B174)","v":9.9}]
[3,14.8,"CHAPPE Estelle",null,null,null,null,14.8]
[4,14.9,"LEFORT Nathalie",null,null,null,null,14.9]
[5,15.6,"LE ROY Sylviane",null,null,null,null,15.6]
[6,16.100000000000001,"HUBERT Marie-Christine",null,null,null,null,16.100000000000001]
[7,17.2,"BOUREL Catherine",null,null,null,null,17.2]
[8,null,null,null,null,null,null,""]
["Personne autorisée à donner des conseils :"]
["Si cette personne n'est pas le capitaine, ce dernier ne pourra pas donner de conseils dans les conditions fixées par la note de la règle de golf n°8"]
["CAPITAINE :"]
[]
["DATE :",null,null,"Signature du Capitaine"]
[]
[]
[{"$f":"Prépa!$D$2","v":"INTERCLUBS PAR EQUIPES PROMOTION MID DAMES"}]
[{"$f":"Prépa!$D$4","v":"Inter régions  OUEST"}]
[{"$f":"Prépa!$D$6","v":"19 et 20 juin 2021 au Golf de Saint Cast"}]
[]
[]
["Fiche de composition d'Equipe"]
["Equipières du club de :",null,null,null,{"$f":"Prépa!$D$27","v":"NANTES ERDRE"}]
[null,"Ind","NOM",null,null,"Prénom",null,"Ind. Arr."]
[1,4.8,"TERRIER Emmanuelle",null,null,null,null,{"$f":"IF(B196=\"\",\"\",B196)","v":4.8}]
[2,5.7,"MATHY Marie",null,null,null,null,{"$f":"IF(B197=\"\",\"\",B197)","v":5.7}]
[3,9.1,"GOFFIN Valérie",null,null,null,null,9.1]
[4,11.1,"POINTEAU Sophie",null,null,null,null,11.1]
[5,11.1,"TRICHET Eglantine",null,null,null,null,11.1]
[6,12.8,"DE BRAY Christine",null,null,null,null,12.8]
[7,13,"DELAUNAY Anne",null,null,null,null,13]
[8,13.6,"FRIOUX Christelle",null,null,null,null,13.6]
["Personne autorisée à donner des conseils :"]
["Si cette personne n'est pas le capitaine, ce dernier ne pourra pas donner de conseils dans les conditions fixées par la note de la règle de golf n°8"]
["CAPITAINE :"]
[]
["DATE :",null,null,"Signature du Capitaine"]
[]
[]
[{"$f":"Prépa!$D$2","v":"INTERCLUBS PAR EQUIPES PROMOTION MID DAMES"}]
[{"$f":"Prépa!$D$4","v":"Inter régions  OUEST"}]
[{"$f":"Prépa!$D$6","v":"19 et 20 juin 2021 au Golf de Saint Cast"}]
[]
[]
["Fiche de composition d'Equipe"]
["Equipières du club de :",null,null,null,{"$f":"Prépa!$D$29","v":"ORLEANS DONNERY"}]
[null,"Ind","NOM",null,null,"Prénom",null,"Ind. Arr."]
[1,12.2,"FILLEUL Nathalie",null,null,null,null,{"$f":"IF(B219=\"\",\"\",B219)","v":12.2}]
[2,12.8,"BREUVART Christine",null,null,null,null,{"$f":"IF(B220=\"\",\"\",B220)","v":12.8}]
[3,15.8,"DEHE Delphine",null,null,null,null,15.8]
[4,16.8,"BIMBENET Pascale",null,null,null,null,16.8]
[5,19.600000000000001,"AUTHIER Nathalie",null,null,null,null,19.600000000000001]
[6,21.1,"MAINGUET Odile",null,null,null,null,21.1]
[7,null,null,null,null,null,null,""]
[8,null,null,null,null,null,null,""]
["Personne autorisée à donner des conseils :"]
["Si cette personne n'est pas le capitaine, ce dernier ne pourra pas donner de conseils dans les conditions fixées par la note de la règle de golf n°8"]
["CAPITAINE :"]
[]
["DATE :",null,null,"Signature du Capitaine"]
[]
[]
[{"$f":"Prépa!$D$2","v":"INTERCLUBS PAR EQUIPES PROMOTION MID DAMES"}]
[{"$f":"Prépa!$D$4","v":"Inter régions  OUEST"}]
[{"$f":"Prépa!$D$6","v":"19 et 20 juin 2021 au Golf de Saint Cast"}]
[]
[]
["Fiche de composition d'Equipe"]
["Equipières du club de :",null,null,null,{"$f":"Prépa!$D$31","v":"PLENEUF VAL ANDRE"}]
[null,"Ind","NOM",null,null,"Prénom",null,"Ind. Arr."]
[1,14.5,"LE FLAHEC Olga",null,null,null,null,{"$f":"IF(B242=\"\",\"\",B242)","v":14.5}]
[2,15.7,"FLOQUET Francoise",null,null,null,null,{"$f":"IF(B243=\"\",\"\",B243)","v":15.7}]
[3,15.8,"ROUXEL Marie-Laure",null,null,null,null,15.8]
[4,16.600000000000001,"BASLE Janick",null,null,null,null,16.600000000000001]
[5,17.100000000000001,"TROALEN Juliette",null,null,null,null,17.100000000000001]
[6,17.8,"CINTAS Marie Claude",null,null,null,null,17.8]
[7,17.899999999999999,"GAVARD Samira",null,null,null,null,17.899999999999999]
[8,null,null,null,null,null,null,""]
["Personne autorisée à donner des conseils :"]
["Si cette personne n'est pas le capitaine, ce dernier ne pourra pas donner de conseils dans les conditions fixées par la note de la règle de golf n°8"]
["CAPITAINE :"]
[]
["DATE :",null,null,"Signature du Capitaine"]
[]
[]
[{"$f":"Prépa!$D$2","v":"INTERCLUBS PAR EQUIPES PROMOTION MID DAMES"}]
[{"$f":"Prépa!$D$4","v":"Inter régions  OUEST"}]
[{"$f":"Prépa!$D$6","v":"19 et 20 juin 2021 au Golf de Saint Cast"}]
[]
[]
["Fiche de composition d'Equipe"]
["Equipières du club de :",null,null,null,{"$f":"Prépa!$D$33","v":"SABLES D'OR"}]
[null,"Ind","NOM",null,null,"Prénom",null,"Ind. Arr."]
[1,3.9,"FLANDIN Virginie",null,null,null,null,{"$f":"IF(B265=\"\",\"\",B265)","v":3.9}]
[2,5.8,"PELE Charlotte",null,null,null,null,{"$f":"IF(B266=\"\",\"\",B266)","v":5.8}]
[3,11.8,"LEMERCIER Delphine",null,null,null,null,11.8]
[4,14,"HUCHET Françoise",null,null,null,null,14]
[5,15.3,"COQUELET Chantal",null,null,null,null,15.3]
[6,18.3,"VILPASTEUR Monique",null,null,null,null,18.3]
[7,19.100000000000001,"FLANDIN Béatrice",null,null,null,null,19.100000000000001]
[8,21.7,"LE CLECH Viviane",null,null,null,null,21.7]
["Personne autorisée à donner des conseils :"]
["Si cette personne n'est pas le capitaine, ce dernier ne pourra pas donner de conseils dans les conditions fixées par la note de la règle de golf n°8"]
["CAPITAINE :"]
[]
["DATE :",null,null,"Signature du Capitaine"]
[]
[]
[{"$f":"Prépa!$D$2","v":"INTERCLUBS PAR EQUIPES PROMOTION MID DAMES"}]
[{"$f":"Prépa!$D$4","v":"Inter régions  OUEST"}]
[{"$f":"Prépa!$D$6","v":"19 et 20 juin 2021 au Golf de Saint Cast"}]
[]
[]
["Fiche de composition d'Equipe"]
["Equipières du club de :",null,null,null,{"$f":"Prépa!$D$35","v":"SAINT CAST"}]
[null,"Ind","NOM",null,null,"Prénom",null,"Ind. Arr."]
[1,1.4,"ESCALONA Elodie",null,null,null,null,{"$f":"IF(B288=\"\",\"\",B288)","v":1.4}]
[2,2.2000000000000002,"EMSENS Diane",null,null,null,null,{"$f":"IF(B289=\"\",\"\",B289)","v":2.2000000000000002}]
[3,4.2,"DUPUY Sophie",null,null,null,null,4.2]
[4,8.9,"CHATELLIER Joelle",null,null,null,null,8.9]
[5,8.9,"LE COTTIER Christelle",null,null,null,null,8.9]
[6,10.8,"CHARDEVEL Catherine",null,null,null,null,10.8]
[7,19.399999999999999,"CALENTIER Martine",null,null,null,null,19.399999999999999]
[8,19.8,"GERARD Catherine",null,null,null,null,19.8]
["Personne autorisée à donner des conseils :"]
["Si cette personne n'est pas le capitaine, ce dernier ne pourra pas donner de conseils dans les conditions fixées par la note de la règle de golf n°8"]
["CAPITAINE :"]
[]
["DATE :",null,null,"Signature du Capitaine"]
[]
[]
[{"$f":"Prépa!$D$2","v":"INTERCLUBS PAR EQUIPES PROMOTION MID DAMES"}]
[{"$f":"Prépa!$D$4","v":"Inter régions  OUEST"}]
[{"$f":"Prépa!$D$6","v":"19 et 20 juin 2021 au Golf de Saint Cast"}]
[]
[]
["Fiche de composition d'Equipe"]
["Equipières du club de :",null,null,null,{"$f":"Prépa!$D$37","v":"SAVENAY"}]
[null,"Ind","NOM",null,null,"Prénom",null,"Ind. Arr."]
[1,7.2,"BRAIRE Magali",null,null,null,null,{"$f":"IF(B311=\"\",\"\",B311)","v":7.2}]
[2,7.9,"RENOUS Evelyne",null,null,null,null,{"$f":"IF(B312=\"\",\"\",B312)","v":7.9}]
[3,11.5,"BURGESS Caroline",null,null,null,null,11.5]
[4,11.8,"HEULOT Anita",null,null,null,null,11.8]
[5,18.3,"AUTHIER Yvonne",null,null,null,null,18.3]
[6,null,null,null,null,null,null,""]
[7,null,null,null,null,null,null,""]
[8,null,null,null,null,null,null,""]
["Personne autorisée à donner des conseils :"]
["Si cette personne n'est pas le capitaine, ce dernier ne pourra pas donner de conseils dans les conditions fixées par la note de la règle de golf n°8"]
["CAPITAINE :"]
[]
["DATE :",null,null,"Signature du Capitaine"]
[]
[]
[{"$f":"Prépa!$D$2","v":"INTERCLUBS PAR EQUIPES PROMOTION MID DAMES"}]
[{"$f":"Prépa!$D$4","v":"Inter régions  OUEST"}]
[{"$f":"Prépa!$D$6","v":"19 et 20 juin 2021 au Golf de Saint Cast"}]
[]
[]
["Fiche de composition d'Equipe"]
["Equipières du club de :",null,null,null,{"$f":"Prépa!$D$39","v":0}]
[null,"Ind","NOM",null,null,"Prénom",null,"Ind. Arr."]
[1,null,null,null,null,null,null,{"$f":"IF(B334=\"\",\"\",B334)","v":""}]
[2,null,null,null,null,null,null,{"$f":"IF(B335=\"\",\"\",B335)","v":""}]
[3,null,null,null,null,null,null,""]
[4,null,null,null,null,null,null,""]
[5,null,null,null,null,null,null,""]
[6,null,null,null,null,null,null,""]
[7,null,null,null,null,null,null,""]
[8,null,null,null,null,null,null,""]
["Personne autorisée à donner des conseils :"]
["Si cette personne n'est pas le capitaine, ce dernier ne pourra pas donner de conseils dans les conditions fixées par la note de la règle de golf n°8"]
["CAPITAINE :"]
[]
["DATE :",null,null,"Signature du Capitaine"]
[]
[]
[{"$f":"Prépa!$D$2","v":"INTERCLUBS PAR EQUIPES PROMOTION MID DAMES"}]
[{"$f":"Prépa!$D$4","v":"Inter régions  OUEST"}]
[{"$f":"Prépa!$D$6","v":"19 et 20 juin 2021 au Golf de Saint Cast"}]
[]
[]
["Fiche de composition d'Equipe"]
["Equipières du club de :",null,null,null,{"$f":"Prépa!$D$41","v":0}]
[null,"Ind","NOM",null,null,"Prénom",null,"Ind. Arr."]
[1,null,null,null,null,null,null,{"$f":"IF(B357=\"\",\"\",B357)","v":""}]
[2,null,null,null,null,null,null,{"$f":"IF(B358=\"\",\"\",B358)","v":""}]
[3,null,null,null,null,null,null,""]
[4,null,null,null,null,null,null,""]
[5,null,null,null,null,null,null,""]
[6,null,null,null,null,null,null,""]
[7,null,null,null,null,null,null,""]
[8,null,null,null,null,null,null,""]
["Personne autorisée à donner des conseils :"]
["Si cette personne n'est pas le capitaine, ce dernier ne pourra pas donner de conseils dans les conditions fixées par la note de la règle de golf n°8"]
["CAPITAINE :"]
[]
["DATE :",null,null,"Signature du Capitaine"]
[]
[]
[{"$f":"Prépa!$D$2","v":"INTERCLUBS PAR EQUIPES PROMOTION MID DAMES"}]
[{"$f":"Prépa!$D$4","v":"Inter régions  OUEST"}]
[{"$f":"Prépa!$D$6","v":"19 et 20 juin 2021 au Golf de Saint Cast"}]
[]
[]
["Fiche de composition d'Equipe"]
["Equipières du club de :",null,null,null,{"$f":"Prépa!$D$43","v":0}]
[null,"Ind","NOM",null,null,"Prénom",null,"Ind. Arr."]
[1,null,null,null,null,null,null,{"$f":"IF(B380=\"\",\"\",B380)","v":""}]
[2,null,null,null,null,null,null,{"$f":"IF(B381=\"\",\"\",B381)","v":""}]
[3,null,null,null,null,null,null,""]
[4,null,null,null,null,null,null,""]
[5,null,null,null,null,null,null,""]
[6,null,null,null,null,null,null,""]
[7,null,null,null,null,null,null,""]
[8,null,null,null,null,null,null,""]
["Personne autorisée à donner des conseils :"]
["Si cette personne n'est pas le capitaine, ce dernier ne pourra pas donner de conseils dans les conditions fixées par la note de la règle de golf n°8"]
["CAPITAINE :"]
[]
["DATE :",null,null,"Signature du Capitaine"]
[]
[]
[{"$f":"Prépa!$D$2","v":"INTERCLUBS PAR EQUIPES PROMOTION MID DAMES"}]
[{"$f":"Prépa!$D$4","v":"Inter régions  OUEST"}]
[{"$f":"Prépa!$D$6","v":"19 et 20 juin 2021 au Golf de Saint Cast"}]
[]
[]
["Fiche de composition d'Equipe"]
["Equipières du club de :",null,null,null,{"$f":"Prépa!$D$45","v":0}]
[null,"Ind","NOM",null,null,"Prénom",null,"Ind. Arr."]
[1,null,null,null,null,null,null,{"$f":"IF(B403=\"\",\"\",B403)","v":""}]
[2,null,null,null,null,null,null,{"$f":"IF(B404=\"\",\"\",B404)","v":""}]
[3,null,null,null,null,null,null,""]
[4,null,null,null,null,null,null,""]
[5,null,null,null,null,null,null,""]
[6,null,null,null,null,null,null,""]
[7,null,null,null,null,null,null,""]
[8,null,null,null,null,null,null,""]
["Personne autorisée à donner des conseils :"]
["Si cette personne n'est pas le capitaine, ce dernier ne pourra pas donner de conseils dans les conditions fixées par la note de la règle de golf n°8"]
["CAPITAINE :"]
[]
["DATE :",null,null,"Signature du Capitaine"]
[]
[]
[{"$f":"Prépa!$D$2","v":"INTERCLUBS PAR EQUIPES PROMOTION MID DAMES"}]
[{"$f":"Prépa!$D$4","v":"Inter régions  OUEST"}]
[{"$f":"Prépa!$D$6","v":"19 et 20 juin 2021 au Golf de Saint Cast"}]
[]
[]
["Fiche de composition d'Equipe"]
["Equipières du club de :",null,null,null,{"$f":"Prépa!$D$47","v":0}]
[null,"Ind","NOM",null,null,"Prénom",null,"Ind. Arr."]
[1,null,null,null,null,null,null,{"$f":"IF(B426=\"\",\"\",B426)","v":""}]
[2,null,null,null,null,null,null,{"$f":"IF(B427=\"\",\"\",B427)","v":""}]
[3,null,null,null,null,null,null,""]
[4,null,null,null,null,null,null,""]
[5,null,null,null,null,null,null,""]
[6,null,null,null,null,null,null,""]
[7,null,null,null,null,null,null,""]
[8,null,null,null,null,null,null,""]
["Personne autorisée à donner des conseils :"]
["Si cette personne n'est pas le capitaine, ce dernier ne pourra pas donner de conseils dans les conditions fixées par la note de la règle de golf n°8"]
["CAPITAINE :"]
[]
["DATE :",null,null,"Signature du Capitaine"]
[]
[]
[{"$f":"Prépa!$D$2","v":"INTERCLUBS PAR EQUIPES PROMOTION MID DAMES"}]
[{"$f":"Prépa!$D$4","v":"Inter régions  OUEST"}]
[{"$f":"Prépa!$D$6","v":"19 et 20 juin 2021 au Golf de Saint Cast"}]
[]
[]
["Fiche de composition d'Equipe"]
["Equipières du club de :",null,null,null,{"$f":"Prépa!$D$49","v":0}]
[null,"Ind","NOM",null,null,"Prénom",null,"Ind. Arr."]
[1,null,null,null,null,null,null,{"$f":"IF(B449=\"\",\"\",B449)","v":""}]
[2,null,null,null,null,null,null,{"$f":"IF(B450=\"\",\"\",B450)","v":""}]
[3,null,null,null,null,null,null,""]
[4,null,null,null,null,null,null,""]
[5,null,null,null,null,null,null,""]
[6,null,null,null,null,null,null,""]
[7,null,null,null,null,null,null,""]
[8,null,null,null,null,null,null,""]
["Personne autorisée à donner des conseils :"]
["Si cette personne n'est pas le capitaine, ce dernier ne pourra pas donner de conseils dans les conditions fixées par la note de la règle de golf n°8"]
["CAPITAINE :"]
[]
["DATE :",null,null,"Signature du Capitaine"]
[]
[]
[{"$f":"Prépa!$D$2","v":"INTERCLUBS PAR EQUIPES PROMOTION MID DAMES"}]
[{"$f":"Prépa!$D$4","v":"Inter régions  OUEST"}]
[{"$f":"Prépa!$D$6","v":"19 et 20 juin 2021 au Golf de Saint Cast"}]
[]
[]
["Fiche de composition d'Equipe"]
["Equipières du club de :",null,null,null,{"$f":"Prépa!$D$51","v":0}]
[null,"Ind","NOM",null,null,"Prénom",null,"Ind. Arr."]
[1,null,null,null,null,null,null,{"$f":"IF(B472=\"\",\"\",B472)","v":""}]
[2,null,null,null,null,null,null,{"$f":"IF(B473=\"\",\"\",B473)","v":""}]
[3,null,null,null,null,null,null,""]
[4,null,null,null,null,null,null,""]
[5,null,null,null,null,null,null,""]
[6,null,null,null,null,null,null,""]
[7,null,null,null,null,null,null,""]
[8,null,null,null,null,null,null,""]
["Personne autorisée à donner des conseils :"]
["Si cette personne n'est pas le capitaine, ce dernier ne pourra pas donner de conseils dans les conditions fixées par la note de la règle de golf n°8"]
["CAPITAINE :"]
[]
["DATE :",null,null,"Signature du Capitaine"]
[]
[]
[{"$f":"Prépa!$D$2","v":"INTERCLUBS PAR EQUIPES PROMOTION MID DAMES"}]
[{"$f":"Prépa!$D$4","v":"Inter régions  OUEST"}]
[{"$f":"Prépa!$D$6","v":"19 et 20 juin 2021 au Golf de Saint Cast"}]
[]
[]
["Fiche de composition d'Equipe"]
["Equipières du club de :",null,null,null,{"$f":"Prépa!$D$53","v":0}]
[null,"Ind","NOM",null,null,"Prénom",null,"Ind. Arr."]
[1,null,null,null,null,null,null,{"$f":"IF(B495=\"\",\"\",B495)","v":""}]
[2,null,null,null,null,null,null,{"$f":"IF(B496=\"\",\"\",B496)","v":""}]
[3,null,null,null,null,null,null,""]
[4,null,null,null,null,null,null,""]
[5,null,null,null,null,null,null,""]
[6,null,null,null,null,null,null,""]
[7,null,null,null,null,null,null,""]
[8,null,null,null,null,null,null,""]
["Personne autorisée à donner des conseils :"]
["Si cette personne n'est pas le capitaine, ce dernier ne pourra pas donner de conseils dans les conditions fixées par la note de la règle de golf n°8"]
["CAPITAINE :"]
[]
["DATE :",null,null,"Signature du Capitaine"]
[]
[]
[{"$f":"Prépa!$D$2","v":"INTERCLUBS PAR EQUIPES PROMOTION MID DAMES"}]
[{"$f":"Prépa!$D$4","v":"Inter régions  OUEST"}]
[{"$f":"Prépa!$D$6","v":"19 et 20 juin 2021 au Golf de Saint Cast"}]
[]
[]
["Fiche de composition d'Equipe"]
["Equipières du club de :",null,null,null,{"$f":"Prépa!$D$55","v":0}]
[null,"Ind","NOM",null,null,"Prénom",null,"Ind. Arr."]
[1,null,null,null,null,null,null,{"$f":"IF(B518=\"\",\"\",B518)","v":""}]
[2,null,null,null,null,null,null,{"$f":"IF(B519=\"\",\"\",B519)","v":""}]
[3,null,null,null,null,null,null,""]
[4,null,null,null,null,null,null,""]
[5,null,null,null,null,null,null,""]
[6,null,null,null,null,null,null,""]
[7,null,null,null,null,null,null,""]
[8,null,null,null,null,null,null,""]
["Personne autorisée à donner des conseils :"]
["Si cette personne n'est pas le capitaine, ce dernier ne pourra pas donner de conseils dans les conditions fixées par la note de la règle de golf n°8"]
["CAPITAINE :"]
[]
["DATE :",null,null,"Signature du Capitaine"]
[]
[]
[{"$f":"Prépa!$D$2","v":"INTERCLUBS PAR EQUIPES PROMOTION MID DAMES"}]
[{"$f":"Prépa!$D$4","v":"Inter régions  OUEST"}]
[{"$f":"Prépa!$D$6","v":"19 et 20 juin 2021 au Golf de Saint Cast"}]
[]
[]
["Fiche de composition d'Equipe"]
["Equipières du club de :",null,null,null,{"$f":"Prépa!$D$57","v":0}]
[null,"Ind","NOM",null,null,"Prénom",null,"Ind. Arr."]
[1,null,null,null,null,null,null,{"$f":"IF(B541=\"\",\"\",B541)","v":""}]
[2,null,null,null,null,null,null,{"$f":"IF(B542=\"\",\"\",B542)","v":""}]
[3,null,null,null,null,null,null,""]
[4,null,null,null,null,null,null,""]
[5,null,null,null,null,null,null,""]
[6,null,null,null,null,null,null,""]
[7,null,null,null,null,null,null,""]
[8,null,null,null,null,null,null,""]
["Personne autorisée à donner des conseils :"]
["Si cette personne n'est pas le capitaine, ce dernier ne pourra pas donner de conseils dans les conditions fixées par la note de la règle de golf n°8"]
["CAPITAINE :"]
[]
["DATE :",null,null,"Signature du Capitaine"]
[]
[]
[{"$f":"Prépa!$D$2","v":"INTERCLUBS PAR EQUIPES PROMOTION MID DAMES"}]
[{"$f":"Prépa!$D$4","v":"Inter régions  OUEST"}]
[{"$f":"Prépa!$D$6","v":"19 et 20 juin 2021 au Golf de Saint Cast"}]
[]
[]
["Fiche de composition d'Equipe"]
["Equipières du club de :",null,null,null,{"$f":"Prépa!$D$59","v":0}]
[null,"Ind","NOM",null,null,"Prénom",null,"Ind. Arr."]
[1,null,null,null,null,null,null,{"$f":"IF(B564=\"\",\"\",B564)","v":""}]
[2,null,null,null,null,null,null,{"$f":"IF(B565=\"\",\"\",B565)","v":""}]
[3,null,null,null,null,null,null,""]
[4,null,null,null,null,null,null,""]
[5,null,null,null,null,null,null,""]
[6,null,null,null,null,null,null,""]
[7,null,null,null,null,null,null,""]
[8,null,null,null,null,null,null,""]
["Personne autorisée à donner des conseils :"]
["Si cette personne n'est pas le capitaine, ce dernier ne pourra pas donner de conseils dans les conditions fixées par la note de la règle de golf n°8"]
["CAPITAINE :"]
[]
["DATE :",null,null,"Signature du Capitaine"]
[]
[]
[{"$f":"Prépa!$D$2","v":"INTERCLUBS PAR EQUIPES PROMOTION MID DAMES"}]
[{"$f":"Prépa!$D$4","v":"Inter régions  OUEST"}]
[{"$f":"Prépa!$D$6","v":"19 et 20 juin 2021 au Golf de Saint Cast"}]
[]
[]
["Fiche de composition d'Equipe"]
["Equipières du club de :",null,null,null,{"$f":"Prépa!$D$61","v":0}]
[null,"Ind","NOM",null,null,"Prénom",null,"Ind. Arr."]
[1,null,null,null,null,null,null,{"$f":"IF(B587=\"\",\"\",B587)","v":""}]
[2,null,null,null,null,null,null,{"$f":"IF(B588=\"\",\"\",B588)","v":""}]
[3,null,null,null,null,null,null,""]
[4,null,null,null,null,null,null,""]
[5,null,null,null,null,null,null,""]
[6,null,null,null,null,null,null,""]
[7,null,null,null,null,null,null,""]
[8,null,null,null,null,null,null,""]
["Personne autorisée à donner des conseils :"]
["Si cette personne n'est pas le capitaine, ce dernier ne pourra pas donner de conseils dans les conditions fixées par la note de la règle de golf n°8"]
["CAPITAINE :"]
[]
["DATE :",null,null,"Signature du Capitaine"]

{"sheet":"Donnees","index":3,"n_rows":241,"n_cols":72,"rows_kept":241,"cut":false,"hidden":false,"merged":[[229,11,229,16],[235,2,235,7],[235,11,235,16],[236,2,236,7],[236,11,236,16],[234,11,234,16],[231,0,231,2],[231,4,231,5],[219,11,219,16],[220,2,220,7],[220,11,220,16],[226,2,226,7],[226,11,226,16],[227,2,227,7],[227,11,227,16],[211,11,211,16],[199,2,199,7],[199,11,199,16],[200,2,200,7],[200,11,200,16],[201,2,201,7],[201,11,201,16],[192,2,192,7],[192,11,192,16],[202,2,202,7],[202,11,202,16],[208,2,208,7],[208,11,208,16],[209,2,209,7],[209,11,209,16],[207,11,207,16],[206,11,206,13],[210,11,210,16],[190,11,190,16],[191,11,191,16],[193,2,193,7],[193,11,193,16],[195,0,195,2],[195,4,195,5],[197,11,197,13],[198,11,198,16],[157,11,157,16],[175,2,175,7],[175,11,175,16],[181,2,181,7],[181,11,181,16],[182,2,182,7],[182,11,182,16],[179,11,179,13],[180,11,180,16],[172,2,172,7],[172,11,172,16],[173,2,173,7],[173,11,173,16],[174,2,174,7],[174,11,174,16],[183,2,183,7],[147,11,147,16],[148,2,148,7],[148,11,148,16],[154,2,154,7],[154,11,154,16],[152,11,152,13],[153,11,153,16],[155,11,155,16],[156,11,156,16],[139,11,139,16],[145,2,145,7],[145,11,145,16],[146,2,146,7],[146,11,146,16],[143,11,143,13],[144,11,144,16],[143,2,143,4],[141,0,141,2],[102,2,102,7],[102,11,102,16],[103,2,103,7],[103,11,103,16],[109,2,109,7],[109,11,109,16],[107,11,107,13],[108,11,108,16],[105,0,105,2],[105,4,105,5],[94,2,94,7],[94,11,94,16],[100,2,100,7],[100,11,100,16],[101,2,101,7],[101,11,101,16],[96,0,96,2],[96,4,96,5],[98,2,98,4],[98,11,98,13],[99,11,99,16],[84,2,84,7],[84,11,84,16],[85,2,85,7],[85,11,85,16],[91,2,91,7],[91,11,91,16],[89,11,89,13],[90,11,90,16],[87,4,87,5],[89,2,89,4],[87,0,87,2],[76,2,76,7],[76,11,76,16],[69,0,69,2],[69,4,69,5],[67,2,67,7],[82,2,82,7],[82,11,82,16],[83,2,83,7],[83,11,83,16],[80,11,80,13],[81,11,81,16],[73,2,73,7],[73,11,73,16],[74,2,74,7],[74,11,74,16],[75,2,75,7],[75,11,75,16],[78,0,78,2],[78,4,78,5],[22,2,22,7],[22,11,22,16],[28,2,28,7],[28,11,28,16],[29,2,29,7],[29,11,29,16],[24,0,24,2],[24,4,24,5],[19,2,19,7],[19,11,19,16],[20,2,20,7],[20,11,20,16],[21,2,21,7],[21,11,21,16],[240,0,240,2],[240,4,240,5],[237,2,237,7],[238,2,238,7],[204,0,204,2],[204,4,204,5],[213,0,213,2],[213,4,213,5],[222,0,222,2],[222,4,222,5],[210,2,210,7],[211,2,211,7],[217,2,217,7],[218,2,218,7],[229,2,229,7],[184,2,184,7],[190,2,190,7],[191,2,191,7],[150,0,150,2],[150,4,150,5],[159,0,159,2],[159,4,159,5],[168,0,168,2],[168,4,168,5],[166,2,166,7],[188,2,188,4],[177,0,177,2],[177,4,177,5],[186,0,186,2],[186,4,186,5],[163,2,163,7],[164,2,164,7],[165,2,165,7],[123,0,123,2],[123,4,123,5],[132,0,132,2],[121,2,121,7],[127,2,127,7],[128,2,128,7],[110,2,110,7],[111,2,111,7],[112,2,112,7],[125,2,125,4],[129,2,129,7],[118,2,118,7],[119,2,119,7],[120,2,120,7],[114,0,114,2],[114,4,114,5],[130,2,130,7],[132,4,132,5],[33,0,33,2],[33,4,33,5],[42,0,42,2],[42,4,42,5],[71,2,71,4],[53,2,53,4],[51,0,51,2],[51,4,51,5],[55,2,55,7],[65,2,65,7],[66,2,66,7],[47,2,47,7],[46,2,46,7],[44,2,44,4],[48,2,48,7],[58,2,58,7],[64,2,64,7],[62,2,62,4],[60,0,60,2],[49,2,49,7],[57,2,57,7],[56,2,56,7],[60,4,60,5],[30,2,30,7],[39,2,39,7],[37,2,37,7],[38,2,38,7],[31,2,31,7],[40,2,40,7],[237,11,237,16],[238,11,238,16],[27,11,27,16],[36,11,36,16],[45,11,45,16],[54,11,54,16],[63,11,63,16],[72,11,72,16],[30,11,30,16],[31,11,31,16],[233,11,233,13],[224,11,224,13],[225,11,225,16],[228,11,228,16],[215,11,215,13],[216,11,216,16],[217,11,217,16],[218,11,218,16],[0,0,0,17],[15,0,15,2],[15,4,15,5],[1,0,1,16],[2,0,2,17],[3,0,3,17],[4,0,4,17],[9,11,9,16],[10,2,10,7],[11,2,11,7],[6,0,6,17],[12,2,12,7],[13,2,13,7],[10,11,10,16],[11,11,11,16],[12,11,12,16],[13,11,13,16],[188,11,188,13],[189,11,189,16],[183,11,183,16],[184,11,184,16],[170,11,170,13],[171,11,171,16],[161,11,161,13],[162,11,162,16],[166,11,166,16],[163,11,163,16],[164,11,164,16],[165,11,165,16],[138,11,138,16],[125,11,125,13],[126,11,126,16],[129,11,129,16],[121,11,121,16],[127,11,127,16],[128,11,128,16],[110,11,110,16],[111,11,111,16],[112,11,112,16],[116,11,116,13],[117,11,117,16],[118,11,118,16],[119,11,119,16],[120,11,120,16],[130,11,130,16],[136,11,136,16],[137,11,137,16],[134,11,134,13],[135,11,135,16],[92,11,92,16],[93,11,93,16],[71,11,71,13],[62,11,62,13],[65,11,65,16],[66,11,66,16],[67,11,67,16],[35,11,35,13],[26,11,26,13],[53,11,53,13],[55,11,55,16],[56,11,56,16],[46,11,46,16],[44,11,44,13],[47,11,47,16],[48,11,48,16],[58,11,58,16],[64,11,64,16],[49,11,49,16],[57,11,57,16],[17,11,17,13],[18,11,18,16],[37,11,37,16],[38,11,38,16],[39,11,39,16],[40,11,40,16],[8,11,8,13],[233,2,233,4],[206,2,206,4],[215,2,215,4],[224,2,224,4],[219,2,219,7],[228,2,228,7],[197,2,197,4],[116,2,116,4],[107,2,107,4],[141,4,141,5],[35,2,35,4],[26,2,26,4],[8,2,8,4],[17,2,17,4],[92,2,92,7],[93,2,93,7],[80,2,80,4],[138,2,138,7],[161,2,161,4],[134,2,134,4],[152,2,152,4],[170,2,170,4],[179,2,179,4],[155,2,155,7],[156,2,156,7],[157,2,157,7],[136,2,136,7],[137,2,137,7],[139,2,139,7],[147,2,147,7]]}
["Cliquez dans la cellule du nom du joueur puis sur la fléche et choisir le nom dans le menu déroulant. Vous pouvez, au choix, soit rentrer directement le score du joueur soit, en faisant \"click droit\" sur la cellule, rentrer la carte de score.En cas de forfait, abandon ou disqualification, inscrire: FOR,ABN ou DIS dans la colonne de score.LES CALCULS SONT FAITS AUTOMATIQUEMENT. POUR OBTENIR LE CLASSEMENT PROVISOIRE OU DEFINITIF, CLIQUER SUR LE BOUTON CI-DESSOUS."]
["Si le nombre de vagues complètes à la fin du 2ème Tour est inférieur à 4, inscrire le nombre de vagues complètes ci-contre (mini 3) :\nAttention à ne pas mettre de score dans les cases grises qui apparaissent si le nombre de vagues est inférieur à 4",null,null,null,null,null,null,null,null,null,null,null,null,null,null,null,null,"e",null,null,{"$f":"Prépa!$D11","v":"BAUGE"},null,{"$f":"Prépa!$D13","v":"BOIS D'O"},null,{"$f":"Prépa!$D15","v":"CH. CHEVERNY"},null,{"$f":"Prépa!$D17","v":"CHARTRES FONTENAY"},null,{"$f":"Prépa!$D19","v":"CHOLET"},null,{"$f":"Prépa!$D21","v":"GLORIETTE"},null,{"$f":"Prépa!$D23","v":"LAC AU DUC"},null,{"$f":"Prépa!$D25","v":"LAVAL"},null,{"$f":"Prépa!$D27","v":"NANTES ERDRE"},null,{"$f":"Prépa!$D29","v":"ORLEANS DONNERY"},null,{"$f":"Prépa!$D31","v":"PLENEUF VAL ANDRE"},null,{"$f":"Prépa!$D33","v":"SABLES D'OR"},null,{"$f":"Prépa!$D35","v":"SAINT CAST"},null,{"$f":"Prépa!$D37","v":"SAVENAY"},null,{"$f":"Prépa!$D39","v":0},null,{"$f":"Prépa!$D41","v":0},null,{"$f":"Prépa!$D43","v":0},null,{"$f":"Prépa!$D45","v":0},null,{"$f":"Prépa!$D47","v":0},null,{"$f":"Prépa!$D49","v":0},null,{"$f":"Prépa!$D51","v":0},null,{"$f":"Prépa!$D53","v":0},null,{"$f":"Prépa!$D55","v":0},null,{"$f":"Prépa!$D57","v":0},null,{"$f":"Prépa!$D59","v":0},null,{"$f":"Prépa!$D61","v":0}]
[{"$f":"Prépa!D2","v":"INTERCLUBS PAR EQUIPES PROMOTION MID DAMES"},null,null,null,null,null,null,null,null,null,null,null,null,null,null,null,null,null,null,null,{"$f":"Particip!$C12","v":"L'HOSTIS Annie"},{"$f":"Particip!$B12","v":14.2},{"$f":"Particip!$C35","v":"CASTEL Stéfany"},{"$f":"Particip!$B35","v":14},{"$f":"Particip!$C58","v":"LORILLOU Carole"},{"$f":"Particip!$B58","v":8.8000000000000007},{"$f":"Particip!$C81","v":"KACZMAREK Nathalie"},{"$f":"Particip!$B81","v":3.6},{"$f":"Particip!$C104","v":"CESBRON Annie"},{"$f":"Particip!$B104","v":12},{"$f":"Particip!$C127","v":"MILLET Isabelle"},{"$f":"Particip!$B127","v":15.8},{"$f":"Particip!$C150","v":"URVOIS Christelle"},{"$f":"Particip!$B150","v":4.9000000000000004},{"$f":"Particip!$C173","v":"NAIRIERE Dominique"},{"$f":"Particip!$B173","v":6.2},{"$f":"Particip!$C196","v":"TERRIER Emmanuelle"},{"$f":"Particip!$B196","v":4.8},{"$f":"Particip!$C219","v":"FILLEUL Nathalie"},{"$f":"Particip!$B219","v":12.2},{"$f":"Particip!$C242","v":"LE FLAHEC Olga"},{"$f":"Particip!$B242","v":14.5},{"$f":"Particip!$C265","v":"FLANDIN Virginie"},{"$f":"Particip!$B265","v":3.9},{"$f":"Particip!$C288","v":"ESCALONA Elodie"},{"$f":"Particip!$B288","v":1.4},{"$f":"Particip!$C311","v":"BRAIRE Magali"},{"$f":"Particip!$B311","v":7.2},{"$f":"Particip!$C334","v":0},{"$f":"Particip!$B334","v":0},{"$f":"Particip!$C357","v":0},{"$f":"Particip!$B357","v":0},{"$f":"Particip!$C380","v":0},{"$f":"Particip!$B380","v":0},{"$f":"Particip!$C403","v":0},{"$f":"Particip!$B403","v":0},{"$f":"Particip!$C426","v":0},{"$f":"Particip!$B426","v":0},{"$f":"Particip!$C449","v":0},{"$f":"Particip!$B449","v":0},{"$f":"Particip!$C472","v":0},{"$f":"Particip!$B472","v":0},{"$f":"Particip!$C495","v":0},{"$f":"Particip!$B495","v":0},{"$f":"Particip!$C518","v":0},{"$f":"Particip!$B518","v":0},{"$f":"Particip!$C541","v":0},{"$f":"Particip!$B541","v":0},{"$f":"Particip!$C564","v":0},{"$f":"Particip!$B564","v":0},{"$f":"Particip!$C587","v":0},{"$f":"Particip!$B587","v":0}]
[{"$f":"Prépa!D4","v":"Inter régions  OUEST"},null,null,null,null,null,null,null,null,null,null,null,null,null,null,null,null,null,null,null,{"$f":"Particip!$C13","v":"CHAUVEL Yung"},{"$f":"Particip!$B13","v":16.7},{"$f":"Particip!$C36","v":"REGEON Catherine"},{"$f":"Particip!$B36","v":17.7},{"$f":"Particip!$C59","v":"MARROCCO Maryline"},{"$f":"Particip!$B59","v":11},{"$f":"Particip!$C82","v":"DORISE Celine"},{"$f":"Particip!$B82","v":13.2},{"$f":"Particip!$C105","v":"DEMARET Evelyne"},{"$f":"Particip!$B105","v":12.7},{"$f":"Particip!$C128","v":"GEORGE Catherine"},{"$f":"Particip!$B128","v":20.5},{"$f":"Particip!$C151","v":"ECHELARD Sylvie"},{"$f":"Particip!$B151","v":10.3},{"$f":"Particip!$C174","v":"RAIMBAULT Fabienne"},{"$f":"Particip!$B174","v":9.9},{"$f":"Particip!$C197","v":"MATHY Marie"},{"$f":"Particip!$B197","v":5.7},{"$f":"Particip!$C220","v":"BREUVART Christine"},{"$f":"Particip!$B220","v":12.8},{"$f":"Particip!$C243","v":"FLOQUET Francoise"},{"$f":"Particip!$B243","v":15.7},{"$f":"Particip!$C266","v":"PELE Charlotte"},{"$f":"Particip!$B266","v":5.8},{"$f":"Particip!$C289","v":"EMSENS Diane"},{"$f":"Particip!$B289","v":2.2000000000000002},{"$f":"Particip!$C312","v":"RENOUS Evelyne"},{"$f":"Particip!$B312","v":7.9},{"$f":"Particip!$C335","v":0},{"$f":"Particip!$B335","v":0},{"$f":"Particip!$C358","v":0},{"$f":"Particip!$B358","v":0},{"$f":"Particip!$C381","v":0},{"$f":"Particip!$B381","v":0},{"$f":"Particip!$C404","v":0},{"$f":"Particip!$B404","v":0},{"$f":"Particip!$C427","v":0},{"$f":"Particip!$B427","v":0},{"$f":"Particip!$C450","v":0},{"$f":"Particip!$B450","v":0},{"$f":"Particip!$C473","v":0},{"$f":"Particip!$B473","v":0},{"$f":"Particip!$C496","v":0},{"$f":"Particip!$B496","v":0},{"$f":"Particip!$C519","v":0},{"$f":"Particip!$B519","v":0},{"$f":"Particip!$C542","v":0},{"$f":"Particip!$B542","v":0},{"$f":"Particip!$C565","v":0},{"$f":"Particip!$B565","v":0},{"$f":"Particip!$C588","v":0},{"$f":"Particip!$B588","v":0}]
[{"$f":"Prépa!D6","v":"19 et 20 juin 2021 au Golf de Saint Cast"},null,null,null,null,null,null,null,null,null,null,null,null,null,null,null,null,null,null,null,{"$f":"Particip!$C14","v":"FRAPREAU Colette"},{"$f":"Particip!$B14","v":21.5},{"$f":"Particip!$C37","v":"HOUGUET Chantal"},{"$f":"Particip!$B37","v":17.899999999999999},{"$f":"Particip!$C60","v":"BOURDEAU Josiane"},{"$f":"Particip!$B60","v":12.5},{"$f":"Particip!$C83","v":"TREMBLAY Fabienne"},{"$f":"Particip!$B83","v":14.5},{"$f":"Particip!$C106","v":"ROUSSEAU Marie-Christine"},{"$f":"Particip!$B106","v":16.2},{"$f":"Particip!$C129","v":"NARDY Marie José"},{"$f":"Particip!$B129","v":21.1},{"$f":"Particip!$C152","v":"RIGUIDEL Annick"},{"$f":"Particip!$B152","v":12.5},{"$f":"Particip!$C175","v":"CHAPPE Estelle"},{"$f":"Particip!$B175","v":14.8},{"$f":"Particip!$C198","v":"GOFFIN Valérie"},{"$f":"Particip!$B198","v":9.1},{"$f":"Particip!$C221","v":"DEHE Delphine"},{"$f":"Particip!$B221","v":15.8},{"$f":"Particip!$C244","v":"ROUXEL Marie-Laure"},{"$f":"Particip!$B244","v":15.8},{"$f":"Particip!$C267","v":"LEMERCIER Delphine"},{"$f":"Particip!$B267","v":11.8},{"$f":"Particip!$C290","v":"DUPUY Sophie"},{"$f":"Particip!$B290","v":4.2},{"$f":"Particip!$C313","v":"BURGESS Caroline"},{"$f":"Particip!$B313","v":11.5},{"$f":"Particip!$C336","v":0},{"$f":"Particip!$B336","v":0},{"$f":"Particip!$C359","v":0},{"$f":"Particip!$B359","v":0},{"$f":"Particip!$C382","v":0},{"$f":"Particip!$B382","v":0},{"$f":"Particip!$C405","v":0},{"$f":"Particip!$B405","v":0},{"$f":"Particip!$C428","v":0},{"$f":"Particip!$B428","v":0},{"$f":"Particip!$C451","v":0},{"$f":"Particip!$B451","v":0},{"$f":"Particip!$C474","v":0},{"$f":"Particip!$B474","v":0},{"$f":"Particip!$C497","v":0},{"$f":"Particip!$B497","v":0},{"$f":"Particip!$C520","v":0},{"$f":"Particip!$B520","v":0},{"$f":"Particip!$C543","v":0},{"$f":"Particip!$B543","v":0},{"$f":"Particip!$C566","v":0},{"$f":"Particip!$B566","v":0},{"$f":"Particip!$C589","v":0},{"$f":"Particip!$B589","v":0}]
[null,null,null,null,null,null,null,null,null,null,null,null,null,null,null,null,null,null,null,null,{"$f":"Particip!$C15","v":"BESSONNEAU Nadine"},{"$f":"Particip!$B15","v":21.6},{"$f":"Particip!$C38","v":"BABILLIOT Marie- Catherine"},{"$f":"Particip!$B38","v":18.100000000000001},{"$f":"Particip!$C61","v":"COUASSE Isabelle"},{"$f":"Particip!$B61","v":13.5},{"$f":"Particip!$C84","v":"SERINET Carole"},{"$f":"Particip!$B84","v":14.6},{"$f":"Particip!$C107","v":"GRAVOUEILLE Chantal"},{"$f":"Particip!$B107","v":17.5},{"$f":"Particip!$C130","v":"CHAUSSONNIERE Catherine"},{"$f":"Particip!$B130","v":23.1},{"$f":"Particip!$C153","v":"LEGRAND Véronique"},{"$f":"Particip!$B153","v":13.9},{"$f":"Particip!$C176","v":"LEFORT Nathalie"},{"$f":"Particip!$B176","v":14.9},{"$f":"Particip!$C199","v":"POINTEAU Sophie"},{"$f":"Particip!$B199","v":11.1},{"$f":"Particip!$C222","v":"BIMBENET Pascale"},{"$f":"Particip!$B222","v":16.8},{"$f":"Particip!$C245","v":"BASLE Janick"},{"$f":"Particip!$B245","v":16.600000000000001},{"$f":"Particip!$C268","v":"HUCHET Françoise"},{"$f":"Particip!$B268","v":14},{"$f":"Particip!$C291","v":"CHATELLIER Joelle"},{"$f":"Particip!$B291","v":8.9},{"$f":"Particip!$C314","v":"HEULOT Anita"},{"$f":"Particip!$B314","v":11.8},{"$f":"Particip!$C337","v":0},{"$f":"Particip!$B337","v":0},{"$f":"Particip!$C360","v":0},{"$f":"Particip!$B360","v":0},{"$f":"Particip!$C383","v":0},{"$f":"Particip!$B383","v":0},{"$f":"Particip!$C406","v":0},{"$f":"Particip!$B406","v":0},{"$f":"Particip!$C429","v":0},{"$f":"Particip!$B429","v":0},{"$f":"Particip!$C452","v":0},{"$f":"Particip!$B452","v":0},{"$f":"Particip!$C475","v":0},{"$f":"Particip!$B475","v":0},{"$f":"Particip!$C498","v":0},{"$f":"Particip!$B498","v":0},{"$f":"Particip!$C521","v":0},{"$f":"Particip!$B521","v":0},{"$f":"Particip!$C544","v":0},{"$f":"Particip!$B544","v":0},{"$f":"Particip!$C567","v":0},{"$f":"Particip!$B567","v":0},{"$f":"Particip!$C590","v":0},{"$f":"Particip!$B590","v":0}]
[{"$f":"IF(R16>0,\"1ère ET 2ème JOURNEES\",\"1ère JOURNEE\")","v":"1ère ET 2ème JOURNEES"},null,null,null,null,null,null,null,null,null,null,null,null,null,null,null,null,null,null,null,{"$f":"Particip!$C16","v":"SOUEF Isabelle"},{"$f":"Particip!$B16","v":22.5},{"$f":"Particip!$C39","v":"VECTEN Véronique"},{"$f":"Particip!$B39","v":19.399999999999999},{"$f":"Particip!$C62","v":"BERNON Patricia"},{"$f":"Particip!$B62","v":15.7},{"$f":"Particip!$C85","v":"PASQUET Anne-Charlotte"},{"$f":"Particip!$B85","v":25.7},{"$f":"Particip!$C108","v":"JULIENNE Virginie"},{"$f":"Particip!$B108","v":18},{"$f":"Particip!$C131","v":"BARRON Nathalie"},{"$f":"Particip!$B131","v":23.8},{"$f":"Particip!$C154","v":"VISSER Maryvonne"},{"$f":"Particip!$B154","v":16.8},{"$f":"Particip!$C177","v":"LE ROY Sylviane"},{"$f":"Particip!$B177","v":15.6},{"$f":"Particip!$C200","v":"TRICHET Eglantine"},{"$f":"Particip!$B200","v":11.1},{"$f":"Particip!$C223","v":"AUTHIER Nathalie"},{"$f":"Particip!$B223","v":19.600000000000001},{"$f":"Particip!$C246","v":"TROALEN Juliette"},{"$f":"Particip!$B246","v":17.100000000000001},{"$f":"Particip!$C269","v":"COQUELET Chantal"},{"$f":"Particip!$B269","v":15.3},{"$f":"Particip!$C292","v":"LE COTTIER Christelle"},{"$f":"Particip!$B292","v":8.9},{"$f":"Particip!$C315","v":"AUTHIER Yvonne"},{"$f":"Particip!$B315","v":18.3},{"$f":"Particip!$C338","v":0},{"$f":"Particip!$B338","v":0},{"$f":"Particip!$C361","v":0},{"$f":"Particip!$B361","v":0},{"$f":"Particip!$C384","v":0},{"$f":"Particip!$B384","v":0},{"$f":"Particip!$C407","v":0},{"$f":"Particip!$B407","v":0},{"$f":"Particip!$C430","v":0},{"$f":"Particip!$B430","v":0},{"$f":"Particip!$C453","v":0},{"$f":"Particip!$B453","v":0},{"$f":"Particip!$C476","v":0},{"$f":"Particip!$B476","v":0},{"$f":"Particip!$C499","v":0},{"$f":"Particip!$B499","v":0},{"$f":"Particip!$C522","v":0},{"$f":"Particip!$B522","v":0},{"$f":"Particip!$C545","v":0},{"$f":"Particip!$B545","v":0},{"$f":"Particip!$C568","v":0},{"$f":"Particip!$B568","v":0},{"$f":"Particip!$C591","v":0},{"$f":"Particip!$B591","v":0}]
[null,null,null,null,null,null,null,null,null,null,null,null,null,null,null,null,null,null,null,null,{"$f":"Particip!$C17","v":"OUDIN Martine"},{"$f":"Particip!$B17","v":22.9},{"$f":"Particip!$C40","v":"POULLAIN Muriel"},{"$f":"Particip!$B40","v":20.100000000000001},{"$f":"Particip!$C63","v":"REVET Josiane"},{"$f":"Particip!$B63","v":17.8},{"$f":"Particip!$C86","v":"BESNARD Delphine"},{"$f":"Particip!$B86","v":28.2},{"$f":"Particip!$C109","v":"PETRELLA Anne"},{"$f":"Particip!$B109","v":18.7},{"$f":"Particip!$C132","v":0},{"$f":"Particip!$B132","v":0},{"$f":"Particip!$C155","v":0},{"$f":"Particip!$B155","v":0},{"$f":"Particip!$C178","v":"HUBERT Marie-Christine"},{"$f":"Particip!$B178","v":16.100000000000001},{"$f":"Particip!$C201","v":"DE BRAY Christine"},{"$f":"Particip!$B201","v":12.8},{"$f":"Particip!$C224","v":"MAINGUET Odile"},{"$f":"Particip!$B224","v":21.1},{"$f":"Particip!$C247","v":"CINTAS Marie Claude"},{"$f":"Particip!$B247","v":17.8},{"$f":"Particip!$C270","v":"VILPASTEUR Monique"},{"$f":"Particip!$B270","v":18.3},{"$f":"Particip!$C293","v":"CHARDEVEL Catherine"},{"$f":"Particip!$B293","v":10.8},{"$f":"Particip!$C316","v":0},{"$f":"Particip!$B316","v":0},{"$f":"Particip!$C339","v":0},{"$f":"Particip!$B339","v":0},{"$f":"Particip!$C362","v":0},{"$f":"Particip!$B362","v":0},{"$f":"Particip!$C385","v":0},{"$f":"Particip!$B385","v":0},{"$f":"Particip!$C408","v":0},{"$f":"Particip!$B408","v":0},{"$f":"Particip!$C431","v":0},{"$f":"Particip!$B431","v":0},{"$f":"Particip!$C454","v":0},{"$f":"Particip!$B454","v":0},{"$f":"Particip!$C477","v":0},{"$f":"Particip!$B477","v":0},{"$f":"Particip!$C500","v":0},{"$f":"Particip!$B500","v":0},{"$f":"Particip!$C523","v":0},{"$f":"Particip!$B523","v":0},{"$f":"Particip!$C546","v":0},{"$f":"Particip!$B546","v":0},{"$f":"Particip!$C569","v":0},{"$f":"Particip!$B569","v":0},{"$f":"Particip!$C592","v":0},{"$f":"Particip!$B592","v":0}]
[null,null,"Equipières du club de :",null,null,{"$f":"Prépa!D11","v":"BAUGE"},null,null,null,null,null,null,null,null,null,null,null,null,null,null,{"$f":"Particip!$C18","v":"AINAULT Cecile"},{"$f":"Particip!$B18","v":24.7},{"$f":"Particip!$C41","v":"JOSSE Marie-Chri"},{"$f":"Particip!$B41","v":23.9},{"$f":"Particip!$C64","v":0},{"$f":"Particip!$B64","v":0},{"$f":"Particip!$C87","v":0},{"$f":"Particip!$B87","v":0},{"$f":"Particip!$C110","v":"BERARD Véronique"},{"$f":"Particip!$B110","v":19},{"$f":"Particip!$C133","v":0},{"$f":"Particip!$B133","v":0},{"$f":"Particip!$C156","v":0},{"$f":"Particip!$B156","v":0},{"$f":"Particip!$C179","v":"BOUREL Catherine"},{"$f":"Particip!$B179","v":17.2},{"$f":"Particip!$C202","v":"DELAUNAY Anne"},{"$f":"Particip!$B202","v":13},{"$f":"Particip!$C225","v":0},{"$f":"Particip!$B225","v":0},{"$f":"Particip!$C248","v":"GAVARD Samira"},{"$f":"Particip!$B248","v":17.899999999999999},{"$f":"Particip!$C271","v":"FLANDIN Béatrice"},{"$f":"Particip!$B271","v":19.100000000000001},{"$f":"Particip!$C294","v":"CALENTIER Martine"},{"$f":"Particip!$B294","v":19.399999999999999},{"$f":"Particip!$C317","v":0},{"$f":"Particip!$B317","v":0},{"$f":"Particip!$C340","v":0},{"$f":"Particip!$B340","v":0},{"$f":"Particip!$C363","v":0},{"$f":"Particip!$B363","v":0},{"$f":"Particip!$C386","v":0},{"$f":"Particip!$B386","v":0},{"$f":"Particip!$C409","v":0},{"$f":"Particip!$B409","v":0},{"$f":"Particip!$C432","v":0},{"$f":"Particip!$B432","v":0},{"$f":"Particip!$C455","v":0},{"$f":"Particip!$B455","v":0},{"$f":"Particip!$C478","v":0},{"$f":"Particip!$B478","v":0},{"$f":"Particip!$C501","v":0},{"$f":"Particip!$B501","v":0},{"$f":"Particip!$C524","v":0},{"$f":"Particip!$B524","v":0},{"$f":"Particip!$C547","v":0},{"$f":"Particip!$B547","v":0},{"$f":"Particip!$C570","v":0},{"$f":"Particip!$B570","v":0},{"$f":"Particip!$C593","v":0},{"$f":"Particip!$B593","v":0}]
[null,"Ind","Joueuses de la 1ère Journée",null,null,null,null,null,"Tour 1",null,"Ind","Joueuses de la 2ème Journée",null,null,null,null,null,"Tour 2","FOR ABN DIS","FOR ABN DIS",{"$f":"Particip!$C19","v":0},{"$f":"Particip!$B19","v":0},{"$f":"Particip!$C42","v":0},{"$f":"Particip!$B42","v":0},{"$f":"Particip!$C65","v":0},{"$f":"Particip!$B65","v":0},{"$f":"Particip!$C88","v":0},{"$f":"Particip!$B88","v":0},{"$f":"Particip!$C111","v":0},{"$f":"Particip!$B111","v":0},{"$f":"Particip!$C134","v":0},{"$f":"Particip!$B134","v":0},{"$f":"Particip!$C157","v":0},{"$f":"Particip!$B157","v":0},{"$f":"Particip!$C180","v":0},{"$f":"Particip!$B180","v":0},{"$f":"Particip!$C203","v":"FRIOUX Christelle"},{"$f":"Particip!$B203","v":13.6},{"$f":"Particip!$C226","v":0},{"$f":"Particip!$B226","v":0},{"$f":"Particip!$C249","v":0},{"$f":"Particip!$B249","v":0},{"$f":"Particip!$C272","v":"LE CLECH Viviane"},{"$f":"Particip!$B272","v":21.7},{"$f":"Particip!$C295","v":"GERARD Catherine"},{"$f":"Particip!$B295","v":19.8},{"$f":"Particip!$C318","v":0},{"$f":"Particip!$B318","v":0},{"$f":"Particip!$C341","v":0},{"$f":"Particip!$B341","v":0},{"$f":"Particip!$C364","v":0},{"$f":"Particip!$B364","v":0},{"$f":"Particip!$C387","v":0},{"$f":"Particip!$B387","v":0},{"$f":"Particip!$C410","v":0},{"$f":"Particip!$B410","v":0},{"$f":"Particip!$C433","v":0},{"$f":"Particip!$B433","v":0},{"$f":"Particip!$C456","v":0},{"$f":"Particip!$B456","v":0},{"$f":"Particip!$C479","v":0},{"$f":"Particip!$B479","v":0},{"$f":"Particip!$C502","v":0},{"$f":"Particip!$B502","v":0},{"$f":"Particip!$C525","v":0},{"$f":"Particip!$B525","v":0},{"$f":"Particip!$C548","v":0},{"$f":"Particip!$B548","v":0},{"$f":"Particip!$C571","v":0},{"$f":"Particip!$B571","v":0},{"$f":"Particip!$C594","v":0},{"$f":"Particip!$B594","v":0}]
["A",{"$f":"IF(C11=\"\",\"\",VLOOKUP(C11,$U$3:$V$15,2,FALSE))","v":14.2},"L'HOSTIS Annie",null,null,null,null,null,86,"A",{"$f":"IF(L11=\"\",\"\",VLOOKUP(L11,$U$3:$V$15,2,FALSE))","v":14.2},"L'HOSTIS Annie",null,null,null,null,null,83,{"$f":"IF(ISTEXT(I11),1,0)","v":0},{"$f":"IF(ISTEXT(R11),1,0)","v":0}]
["B",{"$f":"IF(C12=\"\",\"\",VLOOKUP(C12,$U$3:$V$15,2,FALSE))","v":16.7},"CHAUVEL Yung",null,null,null,null,null,96,"B",{"$f":"IF(L12=\"\",\"\",VLOOKUP(L12,$U$3:$V$15,2,FALSE))","v":16.7},"CHAUVEL Yung",null,null,null,null,null,95,{"$f":"IF(ISTEXT(I12),1,0)","v":0},{"$f":"IF(ISTEXT(R12),1,0)","v":0}]
["C",{"$f":"IF(C13=\"\",\"\",VLOOKUP(C13,$U$3:$V$15,2,FALSE))","v":22.5},"SOUEF Isabelle",null,null,null,null,null,100,"C",{"$f":"IF(L13=\"\",\"\",VLOOKUP(L13,$U$3:$V$15,2,FALSE))","v":21.6},"BESSONNEAU Nadine",null,null,null,null,null,92,{"$f":"IF(ISTEXT(I13),1,0)","v":0},{"$f":"IF(ISTEXT(R13),1,0)","v":0}]
["D",{"$f":"IF(C14=\"\",\"\",VLOOKUP(C14,$U$3:$V$15,2,FALSE))","v":22.9},"OUDIN Martine",null,null,null,null,null,101,"D",{"$f":"IF(L14=\"\",\"\",VLOOKUP(L14,$U$3:$V$15,2,FALSE))","v":21.5},"FRAPREAU Colette",null,null,null,null,null,101,{"$f":"IF(ISTEXT(I14),1,0)","v":0},{"$f":"IF(ISTEXT(R14),1,0)","v":0}]
[]
[{"$f":"IF(SUM(R11:R14)>0,\"Classement Final : \",\"Classement 1er jour : \")","v":"Classement Final : "},null,null,{"$f":"IF(COUNT(I11:I14)<3,\"\",VLOOKUP(F9,'Cl.J1+Gen.'!$Z$11:$AV$36,23,FALSE))","v":14},{"$f":"IF(SUM(R11:R14)>0,\"Total des 2 Tours : \",\"Total 1er Tour : \")","v":"Total des 2 Tours : "},null,{"$f":"IF(OR(I16=\"DIS\",R16=\"DIS\"),\"DIS\",I16+R16)","v":552},null,{"$f":"IF(S16>1,\"DIS\",IF(S16=1,SUM(I11:I14),IF(COUNT(I11:I14)<4,SUM(I11:I14),SUM(I11:I14)-MAX(I11:I14))))","v":282},null,null,null,null,null,null,null,null,{"$f":"IF(T16>1,\"DIS\",IF(T16=1,SUM(R11:R14),IF(COUNT(R11:R14)<4,SUM(R11:R14),SUM(R11:R14)-MAX(R11:R14))))","v":270},{"$f":"SUM(S11:S14)","v":0},{"$f":"SUM(T11:T14)","v":0}]
[]
[null,null,"Equipières du club de :",null,null,{"$f":"Prépa!D13","v":"BOIS D'O"}]
[null,"Ind","Joueuses de la 1ère Journée",null,null,null,null,null,"Tour 1",null,"Ind","Joueuses de la 2ème Journée",null,null,null,null,null,"Tour 2","FOR ABN DIS","FOR ABN DIS"]
["A",{"$f":"IF(C20=\"\",\"\",VLOOKUP(C20,$W$3:$X$15,2,FALSE))","v":14},"CASTEL Stéfany",null,null,null,null,null,89,"A",{"$f":"IF(L20=\"\",\"\",VLOOKUP(L20,$W$3:$X$15,2,FALSE))","v":14},"CASTEL Stéfany",null,null,null,null,null,87,{"$f":"IF(ISTEXT(I20),1,0)","v":0},{"$f":"IF(ISTEXT(R20),1,0)","v":0}]
["B",{"$f":"IF(C21=\"\",\"\",VLOOKUP(C21,$W$3:$X$15,2,FALSE))","v":18.100000000000001},"BABILLIOT Marie- Catherine",null,null,null,null,null,92,"B",{"$f":"IF(L21=\"\",\"\",VLOOKUP(L21,$W$3:$X$15,2,FALSE))","v":18.100000000000001},"BABILLIOT Marie- Catherine",null,null,null,null,null,92,{"$f":"IF(ISTEXT(I21),1,0)","v":0},{"$f":"IF(ISTEXT(R21),1,0)","v":0}]
["C",{"$f":"IF(C22=\"\",\"\",VLOOKUP(C22,$W$3:$X$15,2,FALSE))","v":17.899999999999999},"HOUGUET Chantal",null,null,null,null,null,92,"C",{"$f":"IF(L22=\"\",\"\",VLOOKUP(L22,$W$3:$X$15,2,FALSE))","v":17.899999999999999},"HOUGUET Chantal",null,null,null,null,null,95,{"$f":"IF(ISTEXT(I22),1,0)","v":0},{"$f":"IF(ISTEXT(R22),1,0)","v":0}]
["D",{"$f":"IF(C23=\"\",\"\",VLOOKUP(C23,$W$3:$X$15,2,FALSE))","v":17.7},"REGEON Catherine",null,null,null,null,null,98,"D",{"$f":"IF(L23=\"\",\"\",VLOOKUP(L23,$W$3:$X$15,2,FALSE))","v":20.100000000000001},"POULLAIN Muriel",null,null,null,null,null,92,{"$f":"IF(ISTEXT(I23),1,0)","v":0},{"$f":"IF(ISTEXT(R23),1,0)","v":0}]
[]
[{"$f":"IF(SUM(R20:R23)>0,\"Classement Final : \",\"Classement 1er jour : \")","v":"Classement Final : "},null,null,{"$f":"IF(COUNT(I20:I23)<3,\"\",VLOOKUP(F18,'Cl.J1+Gen.'!$Z$11:$AV$36,23,FALSE))","v":12},{"$f":"IF(SUM(R20:R23)>0,\"Total des 2 Tours : \",\"Total 1er Tour : \")","v":"Total des 2 Tours : "},null,{"$f":"IF(OR(I25=\"DIS\",R25=\"DIS\"),\"DIS\",I25+R25)","v":544},null,{"$f":"IF(S25>1,\"DIS\",IF(S25=1,SUM(I20:I23),IF(COUNT(I20:I23)<4,SUM(I20:I23),SUM(I20:I23)-MAX(I20:I23))))","v":273},null,null,null,null,null,null,null,null,{"$f":"IF(T25>1,\"DIS\",IF(T25=1,SUM(R20:R23),IF(COUNT(R20:R23)<4,SUM(R20:R23),SUM(R20:R23)-MAX(R20:R23))))","v":271},{"$f":"SUM(S20:S23)","v":0},{"$f":"SUM(T20:T23)","v":0}]
[]
[null,null,"Equipières du club de :",null,null,{"$f":"Prépa!D15","v":"CH. CHEVERNY"}]
[null,"Ind","Joueuses de la 1ère Journée",null,null,null,null,null,"Tour 1",null,"Ind","Joueuses de la 2ème Journée",null,null,null,null,null,"Tour 2","FOR ABN DIS","FOR ABN DIS"]
["A",{"$f":"IF(C29=\"\",\"\",VLOOKUP(C29,$Y$3:$Z$15,2,FALSE))","v":13.5},"COUASSE Isabelle",null,null,null,null,null,88,"A",{"$f":"IF(L29=\"\",\"\",VLOOKUP(L29,$Y$3:$Z$15,2,FALSE))","v":13.5},"COUASSE Isabelle",null,null,null,null,null,85,{"$f":"IF(ISTEXT(I29),1,0)","v":0},{"$f":"IF(ISTEXT(R29),1,0)","v":0}]
["B",{"$f":"IF(C30=\"\",\"\",VLOOKUP(C30,$Y$3:$Z$15,2,FALSE))","v":8.8000000000000007},"LORILLOU Carole",null,null,null,null,null,78,"B",{"$f":"IF(L30=\"\",\"\",VLOOKUP(L30,$Y$3:$Z$15,2,FALSE))","v":8.8000000000000007},"LORILLOU Carole",null,null,null,null,null,77,{"$f":"IF(ISTEXT(I30),1,0)","v":0},{"$f":"IF(ISTEXT(R30),1,0)","v":0}]
["C",{"$f":"IF(C31=\"\",\"\",VLOOKUP(C31,$Y$3:$Z$15,2,FALSE))","v":11},"MARROCCO Maryline",null,null,null,null,null,87,"C",{"$f":"IF(L31=\"\",\"\",VLOOKUP(L31,$Y$3:$Z$15,2,FALSE))","v":11},"MARROCCO Maryline",null,null,null,null,null,90,{"$f":"IF(ISTEXT(I31),1,0)","v":0},{"$f":"IF(ISTEXT(R31),1,0)","v":0}]
["D",{"$f":"IF(C32=\"\",\"\",VLOOKUP(C32,$Y$3:$Z$15,2,FALSE))","v":17.8},"REVET Josiane",null,null,null,null,null,93,"D",{"$f":"IF(L32=\"\",\"\",VLOOKUP(L32,$Y$3:$Z$15,2,FALSE))","v":17.8},"REVET Josiane",null,null,null,null,null,98,{"$f":"IF(ISTEXT(I32),1,0)","v":0},{"$f":"IF(ISTEXT(R32),1,0)","v":0}]
[]
[{"$f":"IF(SUM(R29:R32)>0,\"Classement Final : \",\"Classement 1er jour : \")","v":"Classement Final : "},null,null,{"$f":"IF(COUNT(I29:I32)<3,\"\",VLOOKUP(F27,'Cl.J1+Gen.'!$Z$11:$AV$36,23,FALSE))","v":6},{"$f":"IF(SUM(R29:R32)>0,\"Total des 2 Tours : \",\"Total 1er Tour : \")","v":"Total des 2 Tours : "},null,{"$f":"IF(OR(I34=\"DIS\",R34=\"DIS\"),\"DIS\",I34+R34)","v":505},null,{"$f":"IF(S34>1,\"DIS\",IF(S34=1,SUM(I29:I32),IF(COUNT(I29:I32)<4,SUM(I29:I32),SUM(I29:I32)-MAX(I29:I32))))","v":253},null,null,null,null,null,null,null,null,{"$f":"IF(T34>1,\"DIS\",IF(T34=1,SUM(R29:R32),IF(COUNT(R29:R32)<4,SUM(R29:R32),SUM(R29:R32)-MAX(R29:R32))))","v":252},{"$f":"SUM(S29:S32)","v":0},{"$f":"SUM(T29:T32)","v":0}]
[]
[null,null,"Equipières du club de :",null,null,{"$f":"Prépa!D17","v":"CHARTRES FONTENAY"}]
[null,"Ind","Joueuses de la 1ère Journée",null,null,null,null,null,"Tour 1",null,"Ind","Joueuses de la 2ème Journée",null,null,null,null,null,"Tour 2","FOR ABN DIS","FOR ABN DIS"]
["A",{"$f":"IF(C38=\"\",\"\",VLOOKUP(C38,$AA$3:$AB$15,2,FALSE))","v":14.5},"TREMBLAY Fabienne",null,null,null,null,null,78,"A",{"$f":"IF(L38=\"\",\"\",VLOOKUP(L38,$AA$3:$AB$15,2,FALSE))","v":14.5},"TREMBLAY Fabienne",null,null,null,null,null,91,{"$f":"IF(ISTEXT(I38),1,0)","v":0},{"$f":"IF(ISTEXT(R38),1,0)","v":0}]
["B",{"$f":"IF(C39=\"\",\"\",VLOOKUP(C39,$AA$3:$AB$15,2,FALSE))","v":3.6},"KACZMAREK Nathalie",null,null,null,null,null,78,"B",{"$f":"IF(L39=\"\",\"\",VLOOKUP(L39,$AA$3:$AB$15,2,FALSE))","v":3.6},"KACZMAREK Nathalie",null,null,null,null,null,75,{"$f":"IF(ISTEXT(I39),1,0)","v":0},{"$f":"IF(ISTEXT(R39),1,0)","v":0}]
["C",{"$f":"IF(C40=\"\",\"\",VLOOKUP(C40,$AA$3:$AB$15,2,FALSE))","v":14.6},"SERINET Carole",null,null,null,null,null,80,"C",{"$f":"IF(L40=\"\",\"\",VLOOKUP(L40,$AA$3:$AB$15,2,FALSE))","v":14.6},"SERINET Carole",null,null,null,null,null,83,{"$f":"IF(ISTEXT(I40),1,0)","v":0},{"$f":"IF(ISTEXT(R40),1,0)","v":0}]
["D",{"$f":"IF(C41=\"\",\"\",VLOOKUP(C41,$AA$3:$AB$15,2,FALSE))","v":13.2},"DORISE Celine",null,null,null,null,null,83,"D",{"$f":"IF(L41=\"\",\"\",VLOOKUP(L41,$AA$3:$AB$15,2,FALSE))","v":13.2},"DORISE Celine",null,null,null,null,null,90,{"$f":"IF(ISTEXT(I41),1,0)","v":0},{"$f":"IF(ISTEXT(R41),1,0)","v":0}]
[]
[{"$f":"IF(SUM(R38:R41)>0,\"Classement Final : \",\"Classement 1er jour : \")","v":"Classement Final : "},null,null,{"$f":"IF(COUNT(I38:I41)<3,\"\",VLOOKUP(F36,'Cl.J1+Gen.'!$Z$11:$AV$36,23,FALSE))","v":4},{"$f":"IF(SUM(R38:R41)>0,\"Total des 2 Tours : \",\"Total 1er Tour : \")","v":"Total des 2 Tours : "},null,{"$f":"IF(OR(I43=\"DIS\",R43=\"DIS\"),\"DIS\",I43+R43)","v":484},null,{"$f":"IF(S43>1,\"DIS\",IF(S43=1,SUM(I38:I41),IF(COUNT(I38:I41)<4,SUM(I38:I41),SUM(I38:I41)-MAX(I38:I41))))","v":236},null,null,null,null,null,null,null,null,{"$f":"IF(T43>1,\"DIS\",IF(T43=1,SUM(R38:R41),IF(COUNT(R38:R41)<4,SUM(R38:R41),SUM(R38:R41)-MAX(R38:R41))))","v":248},{"$f":"SUM(S38:S41)","v":0},{"$f":"SUM(T38:T41)","v":0}]
[]
[null,null,"Equipières du club de :",null,null,{"$f":"Prépa!D19","v":"CHOLET"}]
[null,"Ind","Joueuses de la 1ère Journée",null,null,null,null,null,"Tour 1",null,"Ind","Joueuses de la 2ème Journée",null,null,null,null,null,"Tour 2","FOR ABN DIS","FOR ABN DIS"]
["A",{"$f":"IF(C47=\"\",\"\",VLOOKUP(C47,$AC$3:$AD$15,2,FALSE))","v":12},"CESBRON Annie",null,null,null,null,null,89,"A",{"$f":"IF(L47=\"\",\"\",VLOOKUP(L47,$AC$3:$AD$15,2,FALSE))","v":12},"CESBRON Annie",null,null,null,null,null,82,{"$f":"IF(ISTEXT(I47),1,0)","v":0},{"$f":"IF(ISTEXT(R47),1,0)","v":0}]
["B",{"$f":"IF(C48=\"\",\"\",VLOOKUP(C48,$AC$3:$AD$15,2,FALSE))","v":12.7},"DEMARET Evelyne",null,null,null,null,null,85,"B",{"$f":"IF(L48=\"\",\"\",VLOOKUP(L48,$AC$3:$AD$15,2,FALSE))","v":19},"BERARD Véronique",null,null,null,null,null,99,{"$f":"IF(ISTEXT(I48),1,0)","v":0},{"$f":"IF(ISTEXT(R48),1,0)","v":0}]
["C",{"$f":"IF(C49=\"\",\"\",VLOOKUP(C49,$AC$3:$AD$15,2,FALSE))","v":18},"JULIENNE Virginie",null,null,null,null,null,88,"C",{"$f":"IF(L49=\"\",\"\",VLOOKUP(L49,$AC$3:$AD$15,2,FALSE))","v":18},"JULIENNE Virginie",null,null,null,null,null,84,{"$f":"IF(ISTEXT(I49),1,0)","v":0},{"$f":"IF(ISTEXT(R49),1,0)","v":0}]
["D",{"$f":"IF(C50=\"\",\"\",VLOOKUP(C50,$AC$3:$AD$15,2,FALSE))","v":19},"BERARD Véronique",null,null,null,null,null,96,"D",{"$f":"IF(L50=\"\",\"\",VLOOKUP(L50,$AC$3:$AD$15,2,FALSE))","v":18.7},"PETRELLA Anne",null,null,null,null,null,93,{"$f":"IF(ISTEXT(I50),1,0)","v":0},{"$f":"IF(ISTEXT(R50),1,0)","v":0}]
[]
[{"$f":"IF(SUM(R47:R50)>0,\"Classement Final : \",\"Classement 1er jour : \")","v":"Classement Final : "},null,null,{"$f":"IF(COUNT(I47:I50)<3,\"\",VLOOKUP(F45,'Cl.J1+Gen.'!$Z$11:$AV$36,23,FALSE))","v":10},{"$f":"IF(SUM(R47:R50)>0,\"Total des 2 Tours : \",\"Total 1er Tour : \")","v":"Total des 2 Tours : "},null,{"$f":"IF(OR(I52=\"DIS\",R52=\"DIS\"),\"DIS\",I52+R52)","v":521},null,{"$f":"IF(S52>1,\"DIS\",IF(S52=1,SUM(I47:I50),IF(COUNT(I47:I50)<4,SUM(I47:I50),SUM(I47:I50)-MAX(I47:I50))))","v":262},null,null,null,null,null,null,null,null,{"$f":"IF(T52>1,\"DIS\",IF(T52=1,SUM(R47:R50),IF(COUNT(R47:R50)<4,SUM(R47:R50),SUM(R47:R50)-MAX(R47:R50))))","v":259},{"$f":"SUM(S47:S50)","v":0},{"$f":"SUM(T47:T50)","v":0}]
[]
[null,null,"Equipières du club de :",null,null,{"$f":"Prépa!D21","v":"GLORIETTE"}]
[null,"Ind","Joueuses de la 1ère Journée",null,null,null,null,null,"Tour 1",null,"Ind","Joueuses de la 2ème Journée",null,null,null,null,null,"Tour 2","FOR ABN DIS","FOR ABN DIS"]
["A",{"$f":"IF(C56=\"\",\"\",VLOOKUP(C56,$AE$3:$AF$15,2,FALSE))","v":20.5},"GEORGE Catherine",null,null,null,null,null,97,"A",{"$f":"IF(L56=\"\",\"\",VLOOKUP(L56,$AE$3:$AF$15,2,FALSE))","v":15.8},"MILLET Isabelle",null,null,null,null,null,83,{"$f":"IF(ISTEXT(I56),1,0)","v":0},{"$f":"IF(ISTEXT(R56),1,0)","v":0}]
["B",{"$f":"IF(C57=\"\",\"\",VLOOKUP(C57,$AE$3:$AF$15,2,FALSE))","v":15.8},"MILLET Isabelle",null,null,null,null,null,82,"B",{"$f":"IF(L57=\"\",\"\",VLOOKUP(L57,$AE$3:$AF$15,2,FALSE))","v":23.1},"CHAUSSONNIERE Catherine",null,null,null,null,null,89,{"$f":"IF(ISTEXT(I57),1,0)","v":0},{"$f":"IF(ISTEXT(R57),1,0)","v":0}]
["C",{"$f":"IF(C58=\"\",\"\",VLOOKUP(C58,$AE$3:$AF$15,2,FALSE))","v":23.8},"BARRON Nathalie",null,null,null,null,null,95,"C",{"$f":"IF(L58=\"\",\"\",VLOOKUP(L58,$AE$3:$AF$15,2,FALSE))","v":23.8},"BARRON Nathalie",null,null,null,null,null,96,{"$f":"IF(ISTEXT(I58),1,0)","v":0},{"$f":"IF(ISTEXT(R58),1,0)","v":0}]
["D",{"$f":"IF(C59=\"\",\"\",VLOOKUP(C59,$AE$3:$AF$15,2,FALSE))","v":23.1},"CHAUSSONNIERE Catherine",null,null,null,null,null,103,"D",{"$f":"IF(L59=\"\",\"\",VLOOKUP(L59,$AE$3:$AF$15,2,FALSE))","v":20.5},"GEORGE Catherine",null,null,null,null,null,92,{"$f":"IF(ISTEXT(I59),1,0)","v":0},{"$f":"IF(ISTEXT(R59),1,0)","v":0}]
[]
[{"$f":"IF(SUM(R56:R59)>0,\"Classement Final : \",\"Classement 1er jour : \")","v":"Classement Final : "},null,null,{"$f":"IF(COUNT(I56:I59)<3,\"\",VLOOKUP(F54,'Cl.J1+Gen.'!$Z$11:$AV$36,23,FALSE))","v":11},{"$f":"IF(SUM(R56:R59)>0,\"Total des 2 Tours : \",\"Total 1er Tour : \")","v":"Total des 2 Tours : "},null,{"$f":"IF(OR(I61=\"DIS\",R61=\"DIS\"),\"DIS\",I61+R61)","v":538},null,{"$f":"IF(S61>1,\"DIS\",IF(S61=1,SUM(I56:I59),IF(COUNT(I56:I59)<4,SUM(I56:I59),SUM(I56:I59)-MAX(I56:I59))))","v":274},null,null,null,null,null,null,null,null,{"$f":"IF(T61>1,\"DIS\",IF(T61=1,SUM(R56:R59),IF(COUNT(R56:R59)<4,SUM(R56:R59),SUM(R56:R59)-MAX(R56:R59))))","v":264},{"$f":"SUM(S56:S59)","v":0},{"$f":"SUM(T56:T59)","v":0}]
[]
[null,null,"Equipières du club de :",null,null,{"$f":"Prépa!D23","v":"LAC AU DUC"}]
[null,"Ind","Joueuses de la 1ère Journée",null,null,null,null,null,"Tour 1",null,"Ind","Joueuses de la 2ème Journée",null,null,null,null,null,"Tour 2","FOR ABN DIS","FOR ABN DIS"]
["A",{"$f":"IF(C65=\"\",\"\",VLOOKUP(C65,$AG$3:$AH$15,2,FALSE))","v":4.9000000000000004},"URVOIS Christelle",null,null,null,null,null,77,"A",{"$f":"IF(L65=\"\",\"\",VLOOKUP(L65,$AG$3:$AH$15,2,FALSE))","v":4.9000000000000004},"URVOIS Christelle",null,null,null,null,null,73,{"$f":"IF(ISTEXT(I65),1,0)","v":0},{"$f":"IF(ISTEXT(R65),1,0)","v":0}]
["B",{"$f":"IF(C66=\"\",\"\",VLOOKUP(C66,$AG$3:$AH$15,2,FALSE))","v":12.5},"RIGUIDEL Annick",null,null,null,null,null,96,"B",{"$f":"IF(L66=\"\",\"\",VLOOKUP(L66,$AG$3:$AH$15,2,FALSE))","v":13.9},"LEGRAND Véronique",null,null,null,null,null,89,{"$f":"IF(ISTEXT(I66),1,0)","v":0},{"$f":"IF(ISTEXT(R66),1,0)","v":0}]
["C",{"$f":"IF(C67=\"\",\"\",VLOOKUP(C67,$AG$3:$AH$15,2,FALSE))","v":10.3},"ECHELARD Sylvie",null,null,null,null,null,93,"C",{"$f":"IF(L67=\"\",\"\",VLOOKUP(L67,$AG$3:$AH$15,2,FALSE))","v":10.3},"ECHELARD Sylvie",null,null,null,null,null,89,{"$f":"IF(ISTEXT(I67),1,0)","v":0},{"$f":"IF(ISTEXT(R67),1,0)","v":0}]
["D",{"$f":"IF(C68=\"\",\"\",VLOOKUP(C68,$AG$3:$AH$15,2,FALSE))","v":13.9},"LEGRAND Véronique",null,null,null,null,null,90,"D",{"$f":"IF(L68=\"\",\"\",VLOOKUP(L68,$AG$3:$AH$15,2,FALSE))","v":12.5},"RIGUIDEL Annick",null,null,null,null,null,97,{"$f":"IF(ISTEXT(I68),1,0)","v":0},{"$f":"IF(ISTEXT(R68),1,0)","v":0}]
[]
[{"$f":"IF(SUM(R65:R68)>0,\"Classement Final : \",\"Classement 1er jour : \")","v":"Classement Final : "},null,null,{"$f":"IF(COUNT(I65:I68)<3,\"\",VLOOKUP(F63,'Cl.J1+Gen.'!$Z$11:$AV$36,23,FALSE))","v":8},{"$f":"IF(SUM(R65:R68)>0,\"Total des 2 Tours : \",\"Total 1er Tour : \")","v":"Total des 2 Tours : "},null,{"$f":"IF(OR(I70=\"DIS\",R70=\"DIS\"),\"DIS\",I70+R70)","v":511},null,{"$f":"IF(S70>1,\"DIS\",IF(S70=1,SUM(I65:I68),IF(COUNT(I65:I68)<4,SUM(I65:I68),SUM(I65:I68)-MAX(I65:I68))))","v":260},null,null,null,null,null,null,null,null,{"$f":"IF(T70>1,\"DIS\",IF(T70=1,SUM(R65:R68),IF(COUNT(R65:R68)<4,SUM(R65:R68),SUM(R65:R68)-MAX(R65:R68))))","v":251},{"$f":"SUM(S65:S68)","v":0},{"$f":"SUM(T65:T68)","v":0}]
[]
[null,null,"Equipières du club de :",null,null,{"$f":"Prépa!D25","v":"LAVAL"}]
[null,"Ind","Joueuses de la 1ère Journée",null,null,null,null,null,"Tour 1",null,"Ind","Joueuses de la 2ème Journée",null,null,null,null,null,"Tour 2","FOR ABN DIS","FOR ABN DIS"]
["A",{"$f":"IF(C74=\"\",\"\",VLOOKUP(C74,$AI$3:$AJ$15,2,FALSE))","v":6.2},"NAIRIERE Dominique",null,null,null,null,null,75,"A",{"$f":"IF(L74=\"\",\"\",VLOOKUP(L74,$AI$3:$AJ$15,2,FALSE))","v":6.2},"NAIRIERE Dominique",null,null,null,null,null,81,{"$f":"IF(ISTEXT(I74),1,0)","v":0},{"$f":"IF(ISTEXT(R74),1,0)","v":0}]
["B",{"$f":"IF(C75=\"\",\"\",VLOOKUP(C75,$AI$3:$AJ$15,2,FALSE))","v":14.8},"CHAPPE Estelle",null,null,null,null,null,89,"B",{"$f":"IF(L75=\"\",\"\",VLOOKUP(L75,$AI$3:$AJ$15,2,FALSE))","v":14.8},"CHAPPE Estelle",null,null,null,null,null,82,{"$f":"IF(ISTEXT(I75),1,0)","v":0},{"$f":"IF(ISTEXT(R75),1,0)","v":0}]
["C",{"$f":"IF(C76=\"\",\"\",VLOOKUP(C76,$AI$3:$AJ$15,2,FALSE))","v":15.6},"LE ROY Sylviane",null,null,null,null,null,94,"C",{"$f":"IF(L76=\"\",\"\",VLOOKUP(L76,$AI$3:$AJ$15,2,FALSE))","v":15.6},"LE ROY Sylviane",null,null,null,null,null,96,{"$f":"IF(ISTEXT(I76),1,0)","v":0},{"$f":"IF(ISTEXT(R76),1,0)","v":0}]
["D",{"$f":"IF(C77=\"\",\"\",VLOOKUP(C77,$AI$3:$AJ$15,2,FALSE))","v":17.2},"BOUREL Catherine",null,null,null,null,null,93,"D",{"$f":"IF(L77=\"\",\"\",VLOOKUP(L77,$AI$3:$AJ$15,2,FALSE))","v":17.2},"BOUREL Catherine",null,null,null,null,null,91,{"$f":"IF(ISTEXT(I77),1,0)","v":0},{"$f":"IF(ISTEXT(R77),1,0)","v":0}]
[]
[{"$f":"IF(SUM(R74:R77)>0,\"Classement Final : \",\"Classement 1er jour : \")","v":"Classement Final : "},null,null,{"$f":"IF(COUNT(I74:I77)<3,\"\",VLOOKUP(F72,'Cl.J1+Gen.'!$Z$11:$AV$36,23,FALSE))","v":7},{"$f":"IF(SUM(R74:R77)>0,\"Total des 2 Tours : \",\"Total 1er Tour : \")","v":"Total des 2 Tours : "},null,{"$f":"IF(OR(I79=\"DIS\",R79=\"DIS\"),\"DIS\",I79+R79)","v":511},null,{"$f":"IF(S79>1,\"DIS\",IF(S79=1,SUM(I74:I77),IF(COUNT(I74:I77)<4,SUM(I74:I77),SUM(I74:I77)-MAX(I74:I77))))","v":257},null,null,null,null,null,null,null,null,{"$f":"IF(T79>1,\"DIS\",IF(T79=1,SUM(R74:R77),IF(COUNT(R74:R77)<4,SUM(R74:R77),SUM(R74:R77)-MAX(R74:R77))))","v":254},{"$f":"SUM(S74:S77)","v":0},{"$f":"SUM(T74:T77)","v":0}]
[]
[null,null,"Equipières du club de :",null,null,{"$f":"Prépa!D27","v":"NANTES ERDRE"}]
[null,"Ind","Joueuses de la 1ère Journée",null,null,null,null,null,"Tour 1",null,"Ind","Joueuses de la 2ème Journée",null,null,null,null,null,"Tour 2","FOR ABN DIS","FOR ABN DIS"]
["A",{"$f":"IF(C83=\"\",\"\",VLOOKUP(C83,$AK$3:$AL$15,2,FALSE))","v":4.8},"TERRIER Emmanuelle",null,null,null,null,null,76,"A",{"$f":"IF(L83=\"\",\"\",VLOOKUP(L83,$AK$3:$AL$15,2,FALSE))","v":4.8},"TERRIER Emmanuelle",null,null,null,null,null,77,{"$f":"IF(ISTEXT(I83),1,0)","v":0},{"$f":"IF(ISTEXT(R83),1,0)","v":0}]
["B",{"$f":"IF(C84=\"\",\"\",VLOOKUP(C84,$AK$3:$AL$15,2,FALSE))","v":5.7},"MATHY Marie",null,null,null,null,null,85,"B",{"$f":"IF(L84=\"\",\"\",VLOOKUP(L84,$AK$3:$AL$15,2,FALSE))","v":5.7},"MATHY Marie",null,null,null,null,null,78,{"$f":"IF(ISTEXT(I84),1,0)","v":0},{"$f":"IF(ISTEXT(R84),1,0)","v":0}]
["C",{"$f":"IF(C85=\"\",\"\",VLOOKUP(C85,$AK$3:$AL$15,2,FALSE))","v":9.1},"GOFFIN Valérie",null,null,null,null,null,84,"C",{"$f":"IF(L85=\"\",\"\",VLOOKUP(L85,$AK$3:$AL$15,2,FALSE))","v":9.1},"GOFFIN Valérie",null,null,null,null,null,79,{"$f":"IF(ISTEXT(I85),1,0)","v":0},{"$f":"IF(ISTEXT(R85),1,0)","v":0}]
["D",{"$f":"IF(C86=\"\",\"\",VLOOKUP(C86,$AK$3:$AL$15,2,FALSE))","v":11.1},"TRICHET Eglantine",null,null,null,null,null,95,"D",{"$f":"IF(L86=\"\",\"\",VLOOKUP(L86,$AK$3:$AL$15,2,FALSE))","v":11.1},"POINTEAU Sophie",null,null,null,null,null,83,{"$f":"IF(ISTEXT(I86),1,0)","v":0},{"$f":"IF(ISTEXT(R86),1,0)","v":0}]
[]
[{"$f":"IF(SUM(R83:R86)>0,\"Classement Final : \",\"Classement 1er jour : \")","v":"Classement Final : "},null,null,{"$f":"IF(COUNT(I83:I86)<3,\"\",VLOOKUP(F81,'Cl.J1+Gen.'!$Z$11:$AV$36,23,FALSE))","v":3},{"$f":"IF(SUM(R83:R86)>0,\"Total des 2 Tours : \",\"Total 1er Tour : \")","v":"Total des 2 Tours : "},null,{"$f":"IF(OR(I88=\"DIS\",R88=\"DIS\"),\"DIS\",I88+R88)","v":479},null,{"$f":"IF(S88>1,\"DIS\",IF(S88=1,SUM(I83:I86),IF(COUNT(I83:I86)<4,SUM(I83:I86),SUM(I83:I86)-MAX(I83:I86))))","v":245},null,null,null,null,null,null,null,null,{"$f":"IF(T88>1,\"DIS\",IF(T88=1,SUM(R83:R86),IF(COUNT(R83:R86)<4,SUM(R83:R86),SUM(R83:R86)-MAX(R83:R86))))","v":234},{"$f":"SUM(S83:S86)","v":0},{"$f":"SUM(T83:T86)","v":0}]
[]
[null,null,"Equipières du club de :",null,null,{"$f":"Prépa!D29","v":"ORLEANS DONNERY"}]
[null,"Ind","Joueuses de la 1ère Journée",null,null,null,null,null,"Tour 1",null,"Ind","Joueuses de la 2ème Journée",null,null,null,null,null,"Tour 2","FOR ABN DIS","FOR ABN DIS"]
["A",{"$f":"IF(C92=\"\",\"\",VLOOKUP(C92,$AM$3:$AN$15,2,FALSE))","v":12.8},"BREUVART Christine",null,null,null,null,null,85,"A",{"$f":"IF(L92=\"\",\"\",VLOOKUP(L92,$AM$3:$AN$15,2,FALSE))","v":12.8},"BREUVART Christine",null,null,null,null,null,84,{"$f":"IF(ISTEXT(I92),1,0)","v":0},{"$f":"IF(ISTEXT(R92),1,0)","v":0}]
["B",{"$f":"IF(C93=\"\",\"\",VLOOKUP(C93,$AM$3:$AN$15,2,FALSE))","v":19.600000000000001},"AUTHIER Nathalie",null,null,null,null,null,99,"B",{"$f":"IF(L93=\"\",\"\",VLOOKUP(L93,$AM$3:$AN$15,2,FALSE))","v":21.1},"MAINGUET Odile",null,null,null,null,null,89,{"$f":"IF(ISTEXT(I93),1,0)","v":0},{"$f":"IF(ISTEXT(R93),1,0)","v":0}]
["C",{"$f":"IF(C94=\"\",\"\",VLOOKUP(C94,$AM$3:$AN$15,2,FALSE))","v":12.2},"FILLEUL Nathalie",null,null,null,null,null,92,"C",{"$f":"IF(L94=\"\",\"\",VLOOKUP(L94,$AM$3:$AN$15,2,FALSE))","v":12.2},"FILLEUL Nathalie",null,null,null,null,null,78,{"$f":"IF(ISTEXT(I94),1,0)","v":0},{"$f":"IF(ISTEXT(R94),1,0)","v":0}]
["D",{"$f":"IF(C95=\"\",\"\",VLOOKUP(C95,$AM$3:$AN$15,2,FALSE))","v":16.8},"BIMBENET Pascale",null,null,null,null,null,90,"D",{"$f":"IF(L95=\"\",\"\",VLOOKUP(L95,$AM$3:$AN$15,2,FALSE))","v":16.8},"BIMBENET Pascale",null,null,null,null,null,95,{"$f":"IF(ISTEXT(I95),1,0)","v":0},{"$f":"IF(ISTEXT(R95),1,0)","v":0}]
[]
[{"$f":"IF(SUM(R92:R95)>0,\"Classement Final : \",\"Classement 1er jour : \")","v":"Classement Final : "},null,null,{"$f":"IF(COUNT(I92:I95)<3,\"\",VLOOKUP(F90,'Cl.J1+Gen.'!$Z$11:$AV$36,23,FALSE))","v":9},{"$f":"IF(SUM(R92:R95)>0,\"Total des 2 Tours : \",\"Total 1er Tour : \")","v":"Total des 2 Tours : "},null,{"$f":"IF(OR(I97=\"DIS\",R97=\"DIS\"),\"DIS\",I97+R97)","v":518},null,{"$f":"IF(S97>1,\"DIS\",IF(S97=1,SUM(I92:I95),IF(COUNT(I92:I95)<4,SUM(I92:I95),SUM(I92:I95)-MAX(I92:I95))))","v":267},null,null,null,null,null,null,null,null,{"$f":"IF(T97>1,\"DIS\",IF(T97=1,SUM(R92:R95),IF(COUNT(R92:R95)<4,SUM(R92:R95),SUM(R92:R95)-MAX(R92:R95))))","v":251},{"$f":"SUM(S92:S95)","v":0},{"$f":"SUM(T92:T95)","v":0}]
[]
[null,null,"Equipières du club de :",null,null,{"$f":"Prépa!D31","v":"PLENEUF VAL ANDRE"}]
[null,"Ind","Joueuses de la 1ère Journée",null,null,null,null,null,"Tour 1",null,"Ind","Joueuses de la 2ème Journée",null,null,null,null,null,"Tour 2","FOR ABN DIS","FOR ABN DIS"]
["A",{"$f":"IF(C101=\"\",\"\",VLOOKUP(C101,$AO$3:$AP$15,2,FALSE))","v":17.899999999999999},"GAVARD Samira",null,null,null,null,null,94,"A",{"$f":"IF(L101=\"\",\"\",VLOOKUP(L101,$AO$3:$AP$15,2,FALSE))","v":17.100000000000001},"TROALEN Juliette",null,null,null,null,null,93,{"$f":"IF(ISTEXT(I101),1,0)","v":0},{"$f":"IF(ISTEXT(R101),1,0)","v":0}]
["B",{"$f":"IF(C102=\"\",\"\",VLOOKUP(C102,$AO$3:$AP$15,2,FALSE))","v":15.7},"FLOQUET Francoise",null,null,null,null,null,87,"B",{"$f":"IF(L102=\"\",\"\",VLOOKUP(L102,$AO$3:$AP$15,2,FALSE))","v":17.899999999999999},"GAVARD Samira",null,null,null,null,null,95,{"$f":"IF(ISTEXT(I102),1,0)","v":0},{"$f":"IF(ISTEXT(R102),1,0)","v":0}]
["C",{"$f":"IF(C103=\"\",\"\",VLOOKUP(C103,$AO$3:$AP$15,2,FALSE))","v":16.600000000000001},"BASLE Janick",null,null,null,null,null,100,"C",{"$f":"IF(L103=\"\",\"\",VLOOKUP(L103,$AO$3:$AP$15,2,FALSE))","v":15.7},"FLOQUET Francoise",null,null,null,null,null,84,{"$f":"IF(ISTEXT(I103),1,0)","v":0},{"$f":"IF(ISTEXT(R103),1,0)","v":0}]
["D",{"$f":"IF(C104=\"\",\"\",VLOOKUP(C104,$AO$3:$AP$15,2,FALSE))","v":17.100000000000001},"TROALEN Juliette",null,null,null,null,null,97,"D",{"$f":"IF(L104=\"\",\"\",VLOOKUP(L104,$AO$3:$AP$15,2,FALSE))","v":15.8},"ROUXEL Marie-Laure",null,null,null,null,null,89,{"$f":"IF(ISTEXT(I104),1,0)","v":0},{"$f":"IF(ISTEXT(R104),1,0)","v":0}]
[]
[{"$f":"IF(SUM(R101:R104)>0,\"Classement Final : \",\"Classement 1er jour : \")","v":"Classement Final : "},null,null,{"$f":"IF(COUNT(I101:I104)<3,\"\",VLOOKUP(F99,'Cl.J1+Gen.'!$Z$11:$AV$36,23,FALSE))","v":13},{"$f":"IF(SUM(R101:R104)>0,\"Total des 2 Tours : \",\"Total 1er Tour : \")","v":"Total des 2 Tours : "},null,{"$f":"IF(OR(I106=\"DIS\",R106=\"DIS\"),\"DIS\",I106+R106)","v":544},null,{"$f":"IF(S106>1,\"DIS\",IF(S106=1,SUM(I101:I104),IF(COUNT(I101:I104)<4,SUM(I101:I104),SUM(I101:I104)-MAX(I101:I104))))","v":278},null,null,null,null,null,null,null,null,{"$f":"IF(T106>1,\"DIS\",IF(T106=1,SUM(R101:R104),IF(COUNT(R101:R104)<4,SUM(R101:R104),SUM(R101:R104)-MAX(R101:R104))))","v":266},{"$f":"SUM(S101:S104)","v":0},{"$f":"SUM(T101:T104)","v":0}]
[]
[null,null,"Equipières du club de :",null,null,{"$f":"Prépa!D33","v":"SABLES D'OR"},null,null,{"$f":"I115","v":245},null,"Ind","Equipières du club de :",null,null,{"$f":"Prépa!L33","v":0},"TOTAL: ",null,{"$f":"R115","v":232}]
[null,"Ind","Joueuses de la 1ère Journée",null,null,null,null,null,"Tour 1",null,"Ind","Joueuses de la 2ème Journée",null,null,null,null,null,"Tour 2","FOR ABN DIS","FOR ABN DIS"]
["A",{"$f":"IF(C110=\"\",\"\",VLOOKUP(C110,$AQ$3:$AR$15,2,FALSE))","v":3.9},"FLANDIN Virginie",null,null,null,null,null,75,"A",{"$f":"IF(L110=\"\",\"\",VLOOKUP(L110,$AQ$3:$AR$15,2,FALSE))","v":11.8},"LEMERCIER Delphine",null,null,null,null,null,78,{"$f":"IF(ISTEXT(I110),1,0)","v":0},{"$f":"IF(ISTEXT(R110),1,0)","v":0}]
["B",{"$f":"IF(C111=\"\",\"\",VLOOKUP(C111,$AQ$3:$AR$15,2,FALSE))","v":5.8},"PELE Charlotte",null,null,null,null,null,82,"B",{"$f":"IF(L111=\"\",\"\",VLOOKUP(L111,$AQ$3:$AR$15,2,FALSE))","v":5.8},"PELE Charlotte",null,null,null,null,null,79,{"$f":"IF(ISTEXT(I111),1,0)","v":0},{"$f":"IF(ISTEXT(R111),1,0)","v":0}]
["C",{"$f":"IF(C112=\"\",\"\",VLOOKUP(C112,$AQ$3:$AR$15,2,FALSE))","v":11.8},"LEMERCIER Delphine",null,null,null,null,null,88,"C",{"$f":"IF(L112=\"\",\"\",VLOOKUP(L112,$AQ$3:$AR$15,2,FALSE))","v":3.9},"FLANDIN Virginie",null,null,null,null,null,75,{"$f":"IF(ISTEXT(I112),1,0)","v":0},{"$f":"IF(ISTEXT(R112),1,0)","v":0}]
["D",{"$f":"IF(C113=\"\",\"\",VLOOKUP(C113,$AQ$3:$AR$15,2,FALSE))","v":15.3},"COQUELET Chantal",null,null,null,null,null,90,"D",{"$f":"IF(L113=\"\",\"\",VLOOKUP(L113,$AQ$3:$AR$15,2,FALSE))","v":14},"HUCHET Françoise",null,null,null,null,null,88,{"$f":"IF(ISTEXT(I113),1,0)","v":0},{"$f":"IF(ISTEXT(R113),1,0)","v":0}]
[]
[{"$f":"IF(SUM(R110:R113)>0,\"Classement Final : \",\"Classement 1er jour : \")","v":"Classement Final : "},null,null,{"$f":"IF(COUNT(I110:I113)<3,\"\",VLOOKUP(F108,'Cl.J1+Gen.'!$Z$11:$AV$36,23,FALSE))","v":2},{"$f":"IF(SUM(R110:R113)>0,\"Total des 2 Tours : \",\"Total 1er Tour : \")","v":"Total des 2 Tours : "},null,{"$f":"IF(OR(I115=\"DIS\",R115=\"DIS\"),\"DIS\",I115+R115)","v":477},null,{"$f":"IF(S115>1,\"DIS\",IF(S115=1,SUM(I110:I113),IF(COUNT(I110:I113)<4,SUM(I110:I113),SUM(I110:I113)-MAX(I110:I113))))","v":245},null,null,null,null,null,null,null,null,{"$f":"IF(T115>1,\"DIS\",IF(T115=1,SUM(R110:R113),IF(COUNT(R110:R113)<4,SUM(R110:R113),SUM(R110:R113)-MAX(R110:R113))))","v":232},{"$f":"SUM(S110:S113)","v":0},{"$f":"SUM(T110:T113)","v":0}]
[]
[null,null,"Equipières du club de :",null,null,{"$f":"Prépa!D35","v":"SAINT CAST"}]
[null,"Ind","Joueuses de la 1ère Journée",null,null,null,null,null,"Tour 1",null,"Ind","Joueuses de la 2ème Journée",null,null,null,null,null,"Tour 2","FOR ABN DIS","FOR ABN DIS"]
["A",{"$f":"IF(C119=\"\",\"\",VLOOKUP(C119,$AS$3:$AT$15,2,FALSE))","v":2.2000000000000002},"EMSENS Diane",null,null,null,null,null,75,"A",{"$f":"IF(L119=\"\",\"\",VLOOKUP(L119,$AS$3:$AT$15,2,FALSE))","v":2.2000000000000002},"EMSENS Diane",null,null,null,null,null,71,{"$f":"IF(ISTEXT(I119),1,0)","v":0},{"$f":"IF(ISTEXT(R119),1,0)","v":0}]
["B",{"$f":"IF(C120=\"\",\"\",VLOOKUP(C120,$AS$3:$AT$15,2,FALSE))","v":4.2},"DUPUY Sophie",null,null,null,null,null,74,"B",{"$f":"IF(L120=\"\",\"\",VLOOKUP(L120,$AS$3:$AT$15,2,FALSE))","v":4.2},"DUPUY Sophie",null,null,null,null,null,69,{"$f":"IF(ISTEXT(I120),1,0)","v":0},{"$f":"IF(ISTEXT(R120),1,0)","v":0}]
["C",{"$f":"IF(C121=\"\",\"\",VLOOKUP(C121,$AS$3:$AT$15,2,FALSE))","v":8.9},"CHATELLIER Joelle",null,null,null,null,null,81,"C",{"$f":"IF(L121=\"\",\"\",VLOOKUP(L121,$AS$3:$AT$15,2,FALSE))","v":8.9},"CHATELLIER Joelle",null,null,null,null,null,79,{"$f":"IF(ISTEXT(I121),1,0)","v":0},{"$f":"IF(ISTEXT(R121),1,0)","v":0}]
["D",{"$f":"IF(C122=\"\",\"\",VLOOKUP(C122,$AS$3:$AT$15,2,FALSE))","v":1.4},"ESCALONA Elodie",null,null,null,null,null,78,"D",{"$f":"IF(L122=\"\",\"\",VLOOKUP(L122,$AS$3:$AT$15,2,FALSE))","v":1.4},"ESCALONA Elodie",null,null,null,null,null,72,{"$f":"IF(ISTEXT(I122),1,0)","v":0},{"$f":"IF(ISTEXT(R122),1,0)","v":0}]
[]
[{"$f":"IF(SUM(R119:R122)>0,\"Classement Final : \",\"Classement 1er jour : \")","v":"Classement Final : "},null,null,{"$f":"IF(COUNT(I119:I122)<3,\"\",VLOOKUP(F117,'Cl.J1+Gen.'!$Z$11:$AV$36,23,FALSE))","v":1},{"$f":"IF(SUM(R119:R122)>0,\"Total des 2 Tours : \",\"Total 1er Tour : \")","v":"Total des 2 Tours : "},null,{"$f":"IF(OR(I124=\"DIS\",R124=\"DIS\"),\"DIS\",I124+R124)","v":439},null,{"$f":"IF(S124>1,\"DIS\",IF(S124=1,SUM(I119:I122),IF(COUNT(I119:I122)<4,SUM(I119:I122),SUM(I119:I122)-MAX(I119:I122))))","v":227},null,null,null,null,null,null,null,null,{"$f":"IF(T124>1,\"DIS\",IF(T124=1,SUM(R119:R122),IF(COUNT(R119:R122)<4,SUM(R119:R122),SUM(R119:R122)-MAX(R119:R122))))","v":212},{"$f":"SUM(S119:S122)","v":0},{"$f":"SUM(T119:T122)","v":0}]
[]
[null,null,"Equipières du club de :",null,null,{"$f":"Prépa!D37","v":"SAVENAY"}]
[null,"Ind","Joueuses de la 1ère Journée",null,null,null,null,null,"Tour 1",null,"Ind","Joueuses de la 2ème Journée",null,null,null,null,null,"Tour 2","FOR ABN DIS","FOR ABN DIS"]
["A",{"$f":"IF(C128=\"\",\"\",VLOOKUP(C128,$AU$3:$AV$15,2,FALSE))","v":11.5},"BURGESS Caroline",null,null,null,null,null,81,"A",{"$f":"IF(L128=\"\",\"\",VLOOKUP(L128,$AU$3:$AV$15,2,FALSE))","v":11.5},"BURGESS Caroline",null,null,null,null,null,91,{"$f":"IF(ISTEXT(I128),1,0)","v":0},{"$f":"IF(ISTEXT(R128),1,0)","v":0}]
["B",{"$f":"IF(C129=\"\",\"\",VLOOKUP(C129,$AU$3:$AV$15,2,FALSE))","v":7.9},"RENOUS Evelyne",null,null,null,null,null,88,"B",{"$f":"IF(L129=\"\",\"\",VLOOKUP(L129,$AU$3:$AV$15,2,FALSE))","v":7.9},"RENOUS Evelyne",null,null,null,null,null,78,{"$f":"IF(ISTEXT(I129),1,0)","v":0},{"$f":"IF(ISTEXT(R129),1,0)","v":0}]
["C",{"$f":"IF(C130=\"\",\"\",VLOOKUP(C130,$AU$3:$AV$15,2,FALSE))","v":7.2},"BRAIRE Magali",null,null,null,null,null,77,"C",{"$f":"IF(L130=\"\",\"\",VLOOKUP(L130,$AU$3:$AV$15,2,FALSE))","v":7.2},"BRAIRE Magali",null,null,null,null,null,83,{"$f":"IF(ISTEXT(I130),1,0)","v":0},{"$f":"IF(ISTEXT(R130),1,0)","v":0}]
["D",{"$f":"IF(C131=\"\",\"\",VLOOKUP(C131,$AU$3:$AV$15,2,FALSE))","v":11.8},"HEULOT Anita",null,null,null,null,null,84,"D",{"$f":"IF(L131=\"\",\"\",VLOOKUP(L131,$AU$3:$AV$15,2,FALSE))","v":11.8},"HEULOT Anita",null,null,null,null,null,90,{"$f":"IF(ISTEXT(I131),1,0)","v":0},{"$f":"IF(ISTEXT(R131),1,0)","v":0}]
[]
[{"$f":"IF(SUM(R128:R131)>0,\"Classement Final : \",\"Classement 1er jour : \")","v":"Classement Final : "},null,null,{"$f":"IF(COUNT(I128:I131)<3,\"\",VLOOKUP(F126,'Cl.J1+Gen.'!$Z$11:$AV$36,23,FALSE))","v":5},{"$f":"IF(SUM(R128:R131)>0,\"Total des 2 Tours : \",\"Total 1er Tour : \")","v":"Total des 2 Tours : "},null,{"$f":"IF(OR(I133=\"DIS\",R133=\"DIS\"),\"DIS\",I133+R133)","v":493},null,{"$f":"IF(S133>1,\"DIS\",IF(S133=1,SUM(I128:I131),IF(COUNT(I128:I131)<4,SUM(I128:I131),SUM(I128:I131)-MAX(I128:I131))))","v":242},null,null,null,null,null,null,null,null,{"$f":"IF(T133>1,\"DIS\",IF(T133=1,SUM(R128:R131),IF(COUNT(R128:R131)<4,SUM(R128:R131),SUM(R128:R131)-MAX(R128:R131))))","v":251},{"$f":"SUM(S128:S131)","v":0},{"$f":"SUM(T128:T131)","v":0}]
[]
[null,null,"Equipières du club de :",null,null,{"$f":"Prépa!D39","v":0}]
[null,"Ind","Joueuses de la 1ère Journée",null,null,null,null,null,"Tour 1",null,"Ind","Joueuses de la 2ème Journée",null,null,null,null,null,"Tour 2","FOR ABN DIS","FOR ABN DIS"]
["A",{"$f":"IF(C137=\"\",\"\",VLOOKUP(C137,$AW$3:$AX$15,2,FALSE))","v":""},null,null,null,null,null,null,null,"A",{"$f":"IF(L137=\"\",\"\",VLOOKUP(L137,$AW$3:$AX$15,2,FALSE))","v":""},null,null,null,null,null,null,null,{"$f":"IF(ISTEXT(I137),1,0)","v":0},{"$f":"IF(ISTEXT(R137),1,0)","v":0}]
["B",{"$f":"IF(C138=\"\",\"\",VLOOKUP(C138,$AW$3:$AX$15,2,FALSE))","v":""},null,null,null,null,null,null,null,"B",{"$f":"IF(L138=\"\",\"\",VLOOKUP(L138,$AW$3:$AX$15,2,FALSE))","v":""},null,null,null,null,null,null,null,{"$f":"IF(ISTEXT(I138),1,0)","v":0},{"$f":"IF(ISTEXT(R138),1,0)","v":0}]
["C",{"$f":"IF(C139=\"\",\"\",VLOOKUP(C139,$AW$3:$AX$15,2,FALSE))","v":""},null,null,null,null,null,null,null,"C",{"$f":"IF(L139=\"\",\"\",VLOOKUP(L139,$AW$3:$AX$15,2,FALSE))","v":""},null,null,null,null,null,null,null,{"$f":"IF(ISTEXT(I139),1,0)","v":0},{"$f":"IF(ISTEXT(R139),1,0)","v":0}]
["D",{"$f":"IF(C140=\"\",\"\",VLOOKUP(C140,$AW$3:$AX$15,2,FALSE))","v":""},null,null,null,null,null,null,null,"D",{"$f":"IF(L140=\"\",\"\",VLOOKUP(L140,$AW$3:$AX$15,2,FALSE))","v":""},null,null,null,null,null,null,null,{"$f":"IF(ISTEXT(I140),1,0)","v":0},{"$f":"IF(ISTEXT(R140),1,0)","v":0}]
[]
[{"$f":"IF(SUM(R137:R140)>0,\"Classement Final : \",\"Classement 1er jour : \")","v":"Classement 1er jour : "},null,null,{"$f":"IF(COUNT(I137:I140)<3,\"\",VLOOKUP(F135,'Cl.J1+Gen.'!$Z$11:$AV$36,23,FALSE))","v":""},{"$f":"IF(SUM(R137:R140)>0,\"Total des 2 Tours : \",\"Total 1er Tour : \")","v":"Total 1er Tour : "},null,{"$f":"IF(OR(I142=\"DIS\",R142=\"DIS\"),\"DIS\",I142+R142)","v":0},null,{"$f":"IF(S142>1,\"DIS\",IF(S142=1,SUM(I137:I140),IF(COUNT(I137:I140)<4,SUM(I137:I140),SUM(I137:I140)-MAX(I137:I140))))","v":0},null,null,null,null,null,null,null,null,{"$f":"IF(T142>1,\"DIS\",IF(T142=1,SUM(R137:R140),IF(COUNT(R137:R140)<$R$2,SUM(R137:R140),SUM(R137:R140)-MAX(R137:R140))))","v":0},{"$f":"SUM(S137:S140)","v":0},{"$f":"SUM(T137:T140)","v":0}]
[]
[null,null,"Equipières du club de :",null,null,{"$f":"Prépa!D41","v":0}]
[null,"Ind","Joueuses de la 1ère Journée",null,null,null,null,null,"Tour 1",null,"Ind","Joueuses de la 2ème Journée",null,null,null,null,null,"Tour 2","FOR ABN DIS","FOR ABN DIS"]
["A",{"$f":"IF(C146=\"\",\"\",VLOOKUP(C146,$AY$3:$AZ$15,2,FALSE))","v":""},null,null,null,null,null,null,null,"A",{"$f":"IF(L146=\"\",\"\",VLOOKUP(L146,$AY$3:$AZ$15,2,FALSE))","v":""},null,null,null,null,null,null,null,{"$f":"IF(ISTEXT(I146),1,0)","v":0},{"$f":"IF(ISTEXT(R146),1,0)","v":0}]
["B",{"$f":"IF(C147=\"\",\"\",VLOOKUP(C147,$AY$3:$AZ$15,2,FALSE))","v":""},null,null,null,null,null,null,null,"B",{"$f":"IF(L147=\"\",\"\",VLOOKUP(L147,$AY$3:$AZ$15,2,FALSE))","v":""},null,null,null,null,null,null,null,{"$f":"IF(ISTEXT(I147),1,0)","v":0},{"$f":"IF(ISTEXT(R147),1,0)","v":0}]
["C",{"$f":"IF(C148=\"\",\"\",VLOOKUP(C148,$AY$3:$AZ$15,2,FALSE))","v":""},null,null,null,null,null,null,null,"C",{"$f":"IF(L148=\"\",\"\",VLOOKUP(L148,$AY$3:$AZ$15,2,FALSE))","v":""},null,null,null,null,null,null,null,{"$f":"IF(ISTEXT(I148),1,0)","v":0},{"$f":"IF(ISTEXT(R148),1,0)","v":0}]
["D",{"$f":"IF(C149=\"\",\"\",VLOOKUP(C149,$AY$3:$AZ$15,2,FALSE))","v":""},null,null,null,null,null,null,null,"D",{"$f":"IF(L149=\"\",\"\",VLOOKUP(L149,$AY$3:$AZ$15,2,FALSE))","v":""},null,null,null,null,null,null,null,{"$f":"IF(ISTEXT(I149),1,0)","v":0},{"$f":"IF(ISTEXT(R149),1,0)","v":0}]
[]
[{"$f":"IF(SUM(R146:R149)>0,\"Classement Final : \",\"Classement 1er jour : \")","v":"Classement 1er jour : "},null,null,{"$f":"IF(COUNT(I146:I149)<3,\"\",VLOOKUP(F144,'Cl.J1+Gen.'!$Z$11:$AV$36,23,FALSE))","v":""},{"$f":"IF(SUM(R146:R149)>0,\"Total des 2 Tours : \",\"Total 1er Tour : \")","v":"Total 1er Tour : "},null,{"$f":"IF(OR(I151=\"DIS\",R151=\"DIS\"),\"DIS\",I151+R151)","v":0},null,{"$f":"IF(S151>1,\"DIS\",IF(S151=1,SUM(I146:I149),IF(COUNT(I146:I149)<4,SUM(I146:I149),SUM(I146:I149)-MAX(I146:I149))))","v":0},null,null,null,null,null,null,null,null,{"$f":"IF(T151>1,\"DIS\",IF(T151=1,SUM(R146:R149),IF(COUNT(R146:R149)<$R$2,SUM(R146:R149),SUM(R146:R149)-MAX(R146:R149))))","v":0},{"$f":"SUM(S146:S149)","v":0},{"$f":"SUM(T146:T149)","v":0}]
[]
[null,null,"Equipières du club de :",null,null,{"$f":"Prépa!D43","v":0}]
[null,"Ind","Joueuses de la 1ère Journée",null,null,null,null,null,"Tour 1",null,"Ind","Joueuses de la 2ème Journée",null,null,null,null,null,"Tour 2","FOR ABN DIS","FOR ABN DIS"]
["A",{"$f":"IF(C155=\"\",\"\",VLOOKUP(C155,$BA$3:$BB$15,2,FALSE))","v":""},null,null,null,null,null,null,null,"A",{"$f":"IF(L155=\"\",\"\",VLOOKUP(L155,$BA$3:$BB$15,2,FALSE))","v":""},null,null,null,null,null,null,null,{"$f":"IF(ISTEXT(I155),1,0)","v":0},{"$f":"IF(ISTEXT(R155),1,0)","v":0}]
["B",{"$f":"IF(C156=\"\",\"\",VLOOKUP(C156,$BA$3:$BB$15,2,FALSE))","v":""},null,null,null,null,null,null,null,"B",{"$f":"IF(L156=\"\",\"\",VLOOKUP(L156,$BA$3:$BB$15,2,FALSE))","v":""},null,null,null,null,null,null,null,{"$f":"IF(ISTEXT(I156),1,0)","v":0},{"$f":"IF(ISTEXT(R156),1,0)","v":0}]
["C",{"$f":"IF(C157=\"\",\"\",VLOOKUP(C157,$BA$3:$BB$15,2,FALSE))","v":""},null,null,null,null,null,null,null,"C",{"$f":"IF(L157=\"\",\"\",VLOOKUP(L157,$BA$3:$BB$15,2,FALSE))","v":""},null,null,null,null,null,null,null,{"$f":"IF(ISTEXT(I157),1,0)","v":0},{"$f":"IF(ISTEXT(R157),1,0)","v":0}]
["D",{"$f":"IF(C158=\"\",\"\",VLOOKUP(C158,$BA$3:$BB$15,2,FALSE))","v":""},null,null,null,null,null,null,null,"D",{"$f":"IF(L158=\"\",\"\",VLOOKUP(L158,$BA$3:$BB$15,2,FALSE))","v":""},null,null,null,null,null,null,null,{"$f":"IF(ISTEXT(I158),1,0)","v":0},{"$f":"IF(ISTEXT(R158),1,0)","v":0}]
[]
[{"$f":"IF(SUM(R155:R158)>0,\"Classement Final : \",\"Classement 1er jour : \")","v":"Classement 1er jour : "},null,null,{"$f":"IF(COUNT(I155:I158)<3,\"\",VLOOKUP(F153,'Cl.J1+Gen.'!$Z$11:$AV$36,23,FALSE))","v":""},{"$f":"IF(SUM(R155:R158)>0,\"Total des 2 Tours : \",\"Total 1er Tour : \")","v":"Total 1er Tour : "},null,{"$f":"IF(OR(I160=\"DIS\",R160=\"DIS\"),\"DIS\",I160+R160)","v":0},null,{"$f":"IF(S160>1,\"DIS\",IF(S160=1,SUM(I155:I158),IF(COUNT(I155:I158)<4,SUM(I155:I158),SUM(I155:I158)-MAX(I155:I158))))","v":0},null,null,null,null,null,null,null,null,{"$f":"IF(T160>1,\"DIS\",IF(T160=1,SUM(R155:R158),IF(COUNT(R155:R158)<$R$2,SUM(R155:R158),SUM(R155:R158)-MAX(R155:R158))))","v":0},{"$f":"SUM(S155:S158)","v":0},{"$f":"SUM(T155:T158)","v":0}]
[]
[null,null,"Equipières du club de :",null,null,{"$f":"Prépa!D45","v":0}]
[null,"Ind","Joueuses de la 1ère Journée",null,null,null,null,null,"Tour 1",null,"Ind","Joueuses de la 2ème Journée",null,null,null,null,null,"Tour 2","FOR ABN DIS","FOR ABN DIS"]
["A",{"$f":"IF(C164=\"\",\"\",VLOOKUP(C164,$BC$3:$BD$15,2,FALSE))","v":""},null,null,null,null,null,null,null,"A",{"$f":"IF(L164=\"\",\"\",VLOOKUP(L164,$BC$3:$BD$15,2,FALSE))","v":""},null,null,null,null,null,null,null,{"$f":"IF(ISTEXT(I164),1,0)","v":0},{"$f":"IF(ISTEXT(R164),1,0)","v":0}]
["B",{"$f":"IF(C165=\"\",\"\",VLOOKUP(C165,$BC$3:$BD$15,2,FALSE))","v":""},null,null,null,null,null,null,null,"B",{"$f":"IF(L165=\"\",\"\",VLOOKUP(L165,$BC$3:$BD$15,2,FALSE))","v":""},null,null,null,null,null,null,null,{"$f":"IF(ISTEXT(I165),1,0)","v":0},{"$f":"IF(ISTEXT(R165),1,0)","v":0}]
["C",{"$f":"IF(C166=\"\",\"\",VLOOKUP(C166,$BC$3:$BD$15,2,FALSE))","v":""},null,null,null,null,null,null,null,"C",{"$f":"IF(L166=\"\",\"\",VLOOKUP(L166,$BC$3:$BD$15,2,FALSE))","v":""},null,null,null,null,null,null,null,{"$f":"IF(ISTEXT(I166),1,0)","v":0},{"$f":"IF(ISTEXT(R166),1,0)","v":0}]
["D",{"$f":"IF(C167=\"\",\"\",VLOOKUP(C167,$BC$3:$BD$15,2,FALSE))","v":""},null,null,null,null,null,null,null,"D",{"$f":"IF(L167=\"\",\"\",VLOOKUP(L167,$BC$3:$BD$15,2,FALSE))","v":""},null,null,null,null,null,null,null,{"$f":"IF(ISTEXT(I167),1,0)","v":0},{"$f":"IF(ISTEXT(R167),1,0)","v":0}]
[]
[{"$f":"IF(SUM(R164:R167)>0,\"Classement Final : \",\"Classement 1er jour : \")","v":"Classement 1er jour : "},null,null,{"$f":"IF(COUNT(I164:I167)<3,\"\",VLOOKUP(F162,'Cl.J1+Gen.'!$Z$11:$AV$36,23,FALSE))","v":""},{"$f":"IF(SUM(R164:R167)>0,\"Total des 2 Tours : \",\"Total 1er Tour : \")","v":"Total 1er Tour : "},null,{"$f":"IF(OR(I169=\"DIS\",R169=\"DIS\"),\"DIS\",I169+R169)","v":0},null,{"$f":"IF(S169>1,\"DIS\",IF(S169=1,SUM(I164:I167),IF(COUNT(I164:I167)<4,SUM(I164:I167),SUM(I164:I167)-MAX(I164:I167))))","v":0},null,null,null,null,null,null,null,null,{"$f":"IF(T169>1,\"DIS\",IF(T169=1,SUM(R164:R167),IF(COUNT(R164:R167)<$R$2,SUM(R164:R167),SUM(R164:R167)-MAX(R164:R167))))","v":0},{"$f":"SUM(S164:S167)","v":0},{"$f":"SUM(T164:T167)","v":0}]
[]
[null,null,"Equipières du club de :",null,null,{"$f":"Prépa!D47","v":0}]
[null,"Ind","Joueuses de la 1ère Journée",null,null,null,null,null,"Tour 1",null,"Ind","Joueuses de la 2ème Journée",null,null,null,null,null,"Tour 2","FOR ABN DIS","FOR ABN DIS"]
["A",{"$f":"IF(C173=\"\",\"\",VLOOKUP(C173,$BE$3:$BF$15,2,FALSE))","v":""},null,null,null,null,null,null,null,"A",{"$f":"IF(L173=\"\",\"\",VLOOKUP(L173,$BE$3:$BF$15,2,FALSE))","v":""},null,null,null,null,null,null,null,{"$f":"IF(ISTEXT(I173),1,0)","v":0},{"$f":"IF(ISTEXT(R173),1,0)","v":0}]
["B",{"$f":"IF(C174=\"\",\"\",VLOOKUP(C174,$BE$3:$BF$15,2,FALSE))","v":""},null,null,null,null,null,null,null,"B",{"$f":"IF(L174=\"\",\"\",VLOOKUP(L174,$BE$3:$BF$15,2,FALSE))","v":""},null,null,null,null,null,null,null,{"$f":"IF(ISTEXT(I174),1,0)","v":0},{"$f":"IF(ISTEXT(R174),1,0)","v":0}]
["C",{"$f":"IF(C175=\"\",\"\",VLOOKUP(C175,$BE$3:$BF$15,2,FALSE))","v":""},null,null,null,null,null,null,null,"C",{"$f":"IF(L175=\"\",\"\",VLOOKUP(L175,$BE$3:$BF$15,2,FALSE))","v":""},null,null,null,null,null,null,null,{"$f":"IF(ISTEXT(I175),1,0)","v":0},{"$f":"IF(ISTEXT(R175),1,0)","v":0}]
["D",{"$f":"IF(C176=\"\",\"\",VLOOKUP(C176,$BE$3:$BF$15,2,FALSE))","v":""},null,null,null,null,null,null,null,"D",{"$f":"IF(L176=\"\",\"\",VLOOKUP(L176,$BE$3:$BF$15,2,FALSE))","v":""},null,null,null,null,null,null,null,{"$f":"IF(ISTEXT(I176),1,0)","v":0},{"$f":"IF(ISTEXT(R176),1,0)","v":0}]
[]
[{"$f":"IF(SUM(R173:R176)>0,\"Classement Final : \",\"Classement 1er jour : \")","v":"Classement 1er jour : "},null,null,{"$f":"IF(COUNT(I173:I176)<3,\"\",VLOOKUP(F171,'Cl.J1+Gen.'!$Z$11:$AV$36,23,FALSE))","v":""},{"$f":"IF(SUM(R173:R176)>0,\"Total des 2 Tours : \",\"Total 1er Tour : \")","v":"Total 1er Tour : "},null,{"$f":"IF(OR(I178=\"DIS\",R178=\"DIS\"),\"DIS\",I178+R178)","v":0},null,{"$f":"IF(S178>1,\"DIS\",IF(S178=1,SUM(I173:I176),IF(COUNT(I173:I176)<4,SUM(I173:I176),SUM(I173:I176)-MAX(I173:I176))))","v":0},null,null,null,null,null,null,null,null,{"$f":"IF(T178>1,\"DIS\",IF(T178=1,SUM(R173:R176),IF(COUNT(R173:R176)<$R$2,SUM(R173:R176),SUM(R173:R176)-MAX(R173:R176))))","v":0},{"$f":"SUM(S173:S176)","v":0},{"$f":"SUM(T173:T176)","v":0}]
[]
[null,null,"Equipières du club de :",null,null,{"$f":"Prépa!D49","v":0}]
[null,"Ind","Joueuses de la 1ère Journée",null,null,null,null,null,"Tour 1",null,"Ind","Joueuses de la 2ème Journée",null,null,null,null,null,"Tour 2","FOR ABN DIS","FOR ABN DIS"]
["A",{"$f":"IF(C182=\"\",\"\",VLOOKUP(C182,$BG$3:$BH$15,2,FALSE))","v":""},null,null,null,null,null,null,null,"A",{"$f":"IF(L182=\"\",\"\",VLOOKUP(L182,$BG$3:$BH$15,2,FALSE))","v":""},null,null,null,null,null,null,null,{"$f":"IF(ISTEXT(I182),1,0)","v":0},{"$f":"IF(ISTEXT(R182),1,0)","v":0}]
["B",{"$f":"IF(C183=\"\",\"\",VLOOKUP(C183,$BG$3:$BH$15,2,FALSE))","v":""},null,null,null,null,null,null,null,"B",{"$f":"IF(L183=\"\",\"\",VLOOKUP(L183,$BG$3:$BH$15,2,FALSE))","v":""},null,null,null,null,null,null,null,{"$f":"IF(ISTEXT(I183),1,0)","v":0},{"$f":"IF(ISTEXT(R183),1,0)","v":0}]
["C",{"$f":"IF(C184=\"\",\"\",VLOOKUP(C184,$BG$3:$BH$15,2,FALSE))","v":""},null,null,null,null,null,null,null,"C",{"$f":"IF(L184=\"\",\"\",VLOOKUP(L184,$BG$3:$BH$15,2,FALSE))","v":""},null,null,null,null,null,null,null,{"$f":"IF(ISTEXT(I184),1,0)","v":0},{"$f":"IF(ISTEXT(R184),1,0)","v":0}]
["D",{"$f":"IF(C185=\"\",\"\",VLOOKUP(C185,$BG$3:$BH$15,2,FALSE))","v":""},null,null,null,null,null,null,null,"D",{"$f":"IF(L185=\"\",\"\",VLOOKUP(L185,$BG$3:$BH$15,2,FALSE))","v":""},null,null,null,null,null,null,null,{"$f":"IF(ISTEXT(I185),1,0)","v":0},{"$f":"IF(ISTEXT(R185),1,0)","v":0}]
[]
[{"$f":"IF(SUM(R182:R185)>0,\"Classement Final : \",\"Classement 1er jour : \")","v":"Classement 1er jour : "},null,null,{"$f":"IF(COUNT(I182:I185)<3,\"\",VLOOKUP(F180,'Cl.J1+Gen.'!$Z$11:$AV$36,23,FALSE))","v":""},{"$f":"IF(SUM(R182:R185)>0,\"Total des 2 Tours : \",\"Total 1er Tour : \")","v":"Total 1er Tour : "},null,{"$f":"IF(OR(I187=\"DIS\",R187=\"DIS\"),\"DIS\",I187+R187)","v":0},null,{"$f":"IF(S187>1,\"DIS\",IF(S187=1,SUM(I182:I185),IF(COUNT(I182:I185)<4,SUM(I182:I185),SUM(I182:I185)-MAX(I182:I185))))","v":0},null,null,null,null,null,null,null,null,{"$f":"IF(T187>1,\"DIS\",IF(T187=1,SUM(R182:R185),IF(COUNT(R182:R185)<$R$2,SUM(R182:R185),SUM(R182:R185)-MAX(R182:R185))))","v":0},{"$f":"SUM(S182:S185)","v":0},{"$f":"SUM(T182:T185)","v":0}]
[]
[null,null,"Equipières du club de :",null,null,{"$f":"Prépa!D51","v":0}]
[null,"Ind","Joueuses de la 1ère Journée",null,null,null,null,null,"Tour 1",null,"Ind","Joueuses de la 2ème Journée",null,null,null,null,null,"Tour 2","FOR ABN DIS","FOR ABN DIS"]
["A",{"$f":"IF(C191=\"\",\"\",VLOOKUP(C191,$BI$3:$BJ$15,2,FALSE))","v":""},null,null,null,null,null,null,null,"A",{"$f":"IF(L191=\"\",\"\",VLOOKUP(L191,$BI$3:$BJ$15,2,FALSE))","v":""},null,null,null,null,null,null,null,{"$f":"IF(ISTEXT(I191),1,0)","v":0},{"$f":"IF(ISTEXT(R191),1,0)","v":0}]
["B",{"$f":"IF(C192=\"\",\"\",VLOOKUP(C192,$BI$3:$BJ$15,2,FALSE))","v":""},null,null,null,null,null,null,null,"B",{"$f":"IF(L192=\"\",\"\",VLOOKUP(L192,$BI$3:$BJ$15,2,FALSE))","v":""},null,null,null,null,null,null,null,{"$f":"IF(ISTEXT(I192),1,0)","v":0},{"$f":"IF(ISTEXT(R192),1,0)","v":0}]
["C",{"$f":"IF(C193=\"\",\"\",VLOOKUP(C193,$BI$3:$BJ$15,2,FALSE))","v":""},null,null,null,null,null,null,null,"C",{"$f":"IF(L193=\"\",\"\",VLOOKUP(L193,$BI$3:$BJ$15,2,FALSE))","v":""},null,null,null,null,null,null,null,{"$f":"IF(ISTEXT(I193),1,0)","v":0},{"$f":"IF(ISTEXT(R193),1,0)","v":0}]
["D",{"$f":"IF(C194=\"\",\"\",VLOOKUP(C194,$BI$3:$BJ$15,2,FALSE))","v":""},null,null,null,null,null,null,null,"D",{"$f":"IF(L194=\"\",\"\",VLOOKUP(L194,$BI$3:$BJ$15,2,FALSE))","v":""},null,null,null,null,null,null,null,{"$f":"IF(ISTEXT(I194),1,0)","v":0},{"$f":"IF(ISTEXT(R194),1,0)","v":0}]
[]
[{"$f":"IF(SUM(R191:R194)>0,\"Classement Final : \",\"Classement 1er jour : \")","v":"Classement 1er jour : "},null,null,{"$f":"IF(COUNT(I191:I194)<3,\"\",VLOOKUP(F189,'Cl.J1+Gen.'!$Z$11:$AV$36,23,FALSE))","v":""},{"$f":"IF(SUM(R191:R194)>0,\"Total des 2 Tours : \",\"Total 1er Tour : \")","v":"Total 1er Tour : "},null,{"$f":"IF(OR(I196=\"DIS\",R196=\"DIS\"),\"DIS\",I196+R196)","v":0},null,{"$f":"IF(S196>1,\"DIS\",IF(S196=1,SUM(I191:I194),IF(COUNT(I191:I194)<4,SUM(I191:I194),SUM(I191:I194)-MAX(I191:I194))))","v":0},null,null,null,null,null,null,null,null,{"$f":"IF(T196>1,\"DIS\",IF(T196=1,SUM(R191:R194),IF(COUNT(R191:R194)<$R$2,SUM(R191:R194),SUM(R191:R194)-MAX(R191:R194))))","v":0},{"$f":"SUM(S191:S194)","v":0},{"$f":"SUM(T191:T194)","v":0}]
[]
[null,null,"Equipières du club de :",null,null,{"$f":"Prépa!D53","v":0},null,null,{"$f":"I205","v":0},null,"Ind","Equipières du club de :",null,null,{"$f":"Prépa!L53","v":0},"TOTAL: ",null,{"$f":"R205","v":0}]
[null,"Ind","Joueuses de la 1ère Journée",null,null,null,null,null,"Tour 1",null,"Ind","Joueuses de la 2ème Journée",null,null,null,null,null,"Tour 2","FOR ABN DIS","FOR ABN DIS"]
["A",{"$f":"IF(C200=\"\",\"\",VLOOKUP(C200,$BK$3:$BL$15,2,FALSE))","v":""},null,null,null,null,null,null,null,"A",{"$f":"IF(L200=\"\",\"\",VLOOKUP(L200,$BK$3:$BL$15,2,FALSE))","v":""},null,null,null,null,null,null,null,{"$f":"IF(ISTEXT(I200),1,0)","v":0},{"$f":"IF(ISTEXT(R200),1,0)","v":0}]
["B",{"$f":"IF(C201=\"\",\"\",VLOOKUP(C201,$BK$3:$BL$15,2,FALSE))","v":""},null,null,null,null,null,null,null,"B",{"$f":"IF(L201=\"\",\"\",VLOOKUP(L201,$BK$3:$BL$15,2,FALSE))","v":""},null,null,null,null,null,null,null,{"$f":"IF(ISTEXT(I201),1,0)","v":0},{"$f":"IF(ISTEXT(R201),1,0)","v":0}]
["C",{"$f":"IF(C202=\"\",\"\",VLOOKUP(C202,$BK$3:$BL$15,2,FALSE))","v":""},null,null,null,null,null,null,null,"C",{"$f":"IF(L202=\"\",\"\",VLOOKUP(L202,$BK$3:$BL$15,2,FALSE))","v":""},null,null,null,null,null,null,null,{"$f":"IF(ISTEXT(I202),1,0)","v":0},{"$f":"IF(ISTEXT(R202),1,0)","v":0}]
["D",{"$f":"IF(C203=\"\",\"\",VLOOKUP(C203,$BK$3:$BL$15,2,FALSE))","v":""},null,null,null,null,null,null,null,"D",{"$f":"IF(L203=\"\",\"\",VLOOKUP(L203,$BK$3:$BL$15,2,FALSE))","v":""},null,null,null,null,null,null,null,{"$f":"IF(ISTEXT(I203),1,0)","v":0},{"$f":"IF(ISTEXT(R203),1,0)","v":0}]
[]
[{"$f":"IF(SUM(R200:R203)>0,\"Classement Final : \",\"Classement 1er jour : \")","v":"Classement 1er jour : "},null,null,{"$f":"IF(COUNT(I200:I203)<3,\"\",VLOOKUP(F198,'Cl.J1+Gen.'!$Z$11:$AV$36,23,FALSE))","v":""},{"$f":"IF(SUM(R200:R203)>0,\"Total des 2 Tours : \",\"Total 1er Tour : \")","v":"Total 1er Tour : "},null,{"$f":"IF(OR(I205=\"DIS\",R205=\"DIS\"),\"DIS\",I205+R205)","v":0},null,{"$f":"IF(S205>1,\"DIS\",IF(S205=1,SUM(I200:I203),IF(COUNT(I200:I203)<4,SUM(I200:I203),SUM(I200:I203)-MAX(I200:I203))))","v":0},null,null,null,null,null,null,null,null,{"$f":"IF(T205>1,\"DIS\",IF(T205=1,SUM(R200:R203),IF(COUNT(R200:R203)<$R$2,SUM(R200:R203),SUM(R200:R203)-MAX(R200:R203))))","v":0},{"$f":"SUM(S200:S203)","v":0},{"$f":"SUM(T200:T203)","v":0}]
[]
[null,null,"Equipières du club de :",null,null,{"$f":"Prépa!D55","v":0}]
[null,"Ind","Joueuses de la 1ère Journée",null,null,null,null,null,"Tour 1",null,"Ind","Joueuses de la 2ème Journée",null,null,null,null,null,"Tour 2","FOR ABN DIS","FOR ABN DIS"]
["A",{"$f":"IF(C209=\"\",\"\",VLOOKUP(C209,$BM$3:$BN$15,2,FALSE))","v":""},null,null,null,null,null,null,null,"A",{"$f":"IF(L209=\"\",\"\",VLOOKUP(L209,$BM$3:$BN$15,2,FALSE))","v":""},null,null,null,null,null,null,null,{"$f":"IF(ISTEXT(I209),1,0)","v":0},{"$f":"IF(ISTEXT(R209),1,0)","v":0}]
["B",{"$f":"IF(C210=\"\",\"\",VLOOKUP(C210,$BM$3:$BN$15,2,FALSE))","v":""},null,null,null,null,null,null,null,"B",{"$f":"IF(L210=\"\",\"\",VLOOKUP(L210,$BM$3:$BN$15,2,FALSE))","v":""},null,null,null,null,null,null,null,{"$f":"IF(ISTEXT(I210),1,0)","v":0},{"$f":"IF(ISTEXT(R210),1,0)","v":0}]
["C",{"$f":"IF(C211=\"\",\"\",VLOOKUP(C211,$BM$3:$BN$15,2,FALSE))","v":""},null,null,null,null,null,null,null,"C",{"$f":"IF(L211=\"\",\"\",VLOOKUP(L211,$BM$3:$BN$15,2,FALSE))","v":""},null,null,null,null,null,null,null,{"$f":"IF(ISTEXT(I211),1,0)","v":0},{"$f":"IF(ISTEXT(R211),1,0)","v":0}]
["D",{"$f":"IF(C212=\"\",\"\",VLOOKUP(C212,$BM$3:$BN$15,2,FALSE))","v":""},null,null,null,null,null,null,null,"D",{"$f":"IF(L212=\"\",\"\",VLOOKUP(L212,$BM$3:$BN$15,2,FALSE))","v":""},null,null,null,null,null,null,null,{"$f":"IF(ISTEXT(I212),1,0)","v":0},{"$f":"IF(ISTEXT(R212),1,0)","v":0}]
[]
[{"$f":"IF(SUM(R209:R212)>0,\"Classement Final : \",\"Classement 1er jour : \")","v":"Classement 1er jour : "},null,null,{"$f":"IF(COUNT(I209:I212)<3,\"\",VLOOKUP(F207,'Cl.J1+Gen.'!$Z$11:$AV$36,23,FALSE))","v":""},{"$f":"IF(SUM(R209:R212)>0,\"Total des 2 Tours : \",\"Total 1er Tour : \")","v":"Total 1er Tour : "},null,{"$f":"IF(OR(I214=\"DIS\",R214=\"DIS\"),\"DIS\",I214+R214)","v":0},null,{"$f":"IF(S214>1,\"DIS\",IF(S214=1,SUM(I209:I212),IF(COUNT(I209:I212)<4,SUM(I209:I212),SUM(I209:I212)-MAX(I209:I212))))","v":0},null,null,null,null,null,null,null,null,{"$f":"IF(T214>1,\"DIS\",IF(T214=1,SUM(R209:R212),IF(COUNT(R209:R212)<$R$2,SUM(R209:R212),SUM(R209:R212)-MAX(R209:R212))))","v":0},{"$f":"SUM(S209:S212)","v":0},{"$f":"SUM(T209:T212)","v":0}]
[]
[null,null,"Equipières du club de :",null,null,{"$f":"Prépa!D57","v":0}]
[null,"Ind","Joueuses de la 1ère Journée",null,null,null,null,null,"Tour 1",null,"Ind","Joueuses de la 2ème Journée",null,null,null,null,null,"Tour 2","FOR ABN DIS","FOR ABN DIS"]
["A",{"$f":"IF(C218=\"\",\"\",VLOOKUP(C218,$BO$3:$BP$15,2,FALSE))","v":""},null,null,null,null,null,null,null,"A",{"$f":"IF(L218=\"\",\"\",VLOOKUP(L218,$BO$3:$BP$15,2,FALSE))","v":""},null,null,null,null,null,null,null,{"$f":"IF(ISTEXT(I218),1,0)","v":0},{"$f":"IF(ISTEXT(R218),1,0)","v":0}]
["B",{"$f":"IF(C219=\"\",\"\",VLOOKUP(C219,$BO$3:$BP$15,2,FALSE))","v":""},null,null,null,null,null,null,null,"B",{"$f":"IF(L219=\"\",\"\",VLOOKUP(L219,$BO$3:$BP$15,2,FALSE))","v":""},null,null,null,null,null,null,null,{"$f":"IF(ISTEXT(I219),1,0)","v":0},{"$f":"IF(ISTEXT(R219),1,0)","v":0}]
["C",{"$f":"IF(C220=\"\",\"\",VLOOKUP(C220,$BO$3:$BP$15,2,FALSE))","v":""},null,null,null,null,null,null,null,"C",{"$f":"IF(L220=\"\",\"\",VLOOKUP(L220,$BO$3:$BP$15,2,FALSE))","v":""},null,null,null,null,null,null,null,{"$f":"IF(ISTEXT(I220),1,0)","v":0},{"$f":"IF(ISTEXT(R220),1,0)","v":0}]
["D",{"$f":"IF(C221=\"\",\"\",VLOOKUP(C221,$BO$3:$BP$15,2,FALSE))","v":""},null,null,null,null,null,null,null,"D",{"$f":"IF(L221=\"\",\"\",VLOOKUP(L221,$BO$3:$BP$15,2,FALSE))","v":""},null,null,null,null,null,null,null,{"$f":"IF(ISTEXT(I221),1,0)","v":0},{"$f":"IF(ISTEXT(R221),1,0)","v":0}]
[]
[{"$f":"IF(SUM(R218:R221)>0,\"Classement Final : \",\"Classement 1er jour : \")","v":"Classement 1er jour : "},null,null,{"$f":"IF(COUNT(I218:I221)<3,\"\",VLOOKUP(F216,'Cl.J1+Gen.'!$Z$11:$AV$36,23,FALSE))","v":""},{"$f":"IF(SUM(R218:R221)>0,\"Total des 2 Tours : \",\"Total 1er Tour : \")","v":"Total 1er Tour : "},null,{"$f":"IF(OR(I223=\"DIS\",R223=\"DIS\"),\"DIS\",I223+R223)","v":0},null,{"$f":"IF(S223>1,\"DIS\",IF(S223=1,SUM(I218:I221),IF(COUNT(I218:I221)<4,SUM(I218:I221),SUM(I218:I221)-MAX(I218:I221))))","v":0},null,null,null,null,null,null,null,null,{"$f":"IF(T223>1,\"DIS\",IF(T223=1,SUM(R218:R221),IF(COUNT(R218:R221)<$R$2,SUM(R218:R221),SUM(R218:R221)-MAX(R218:R221))))","v":0},{"$f":"SUM(S218:S221)","v":0},{"$f":"SUM(T218:T221)","v":0}]
[]
[null,null,"Equipières du club de :",null,null,{"$f":"Prépa!D59","v":0}]
[null,"Ind","Joueuses de la 1ère Journée",null,null,null,null,null,"Tour 1",null,"Ind","Joueuses de la 2ème Journée",null,null,null,null,null,"Tour 2","FOR ABN DIS","FOR ABN DIS"]
["A",{"$f":"IF(C227=\"\",\"\",VLOOKUP(C227,$BQ$3:$BR$15,2,FALSE))","v":""},null,null,null,null,null,null,null,"A",{"$f":"IF(L227=\"\",\"\",VLOOKUP(L227,$BQ$3:$BR$15,2,FALSE))","v":""},null,null,null,null,null,null,null,{"$f":"IF(ISTEXT(I227),1,0)","v":0},{"$f":"IF(ISTEXT(R227),1,0)","v":0}]
["B",{"$f":"IF(C228=\"\",\"\",VLOOKUP(C228,$BQ$3:$BR$15,2,FALSE))","v":""},null,null,null,null,null,null,null,"B",{"$f":"IF(L228=\"\",\"\",VLOOKUP(L228,$BQ$3:$BR$15,2,FALSE))","v":""},null,null,null,null,null,null,null,{"$f":"IF(ISTEXT(I228),1,0)","v":0},{"$f":"IF(ISTEXT(R228),1,0)","v":0}]
["C",{"$f":"IF(C229=\"\",\"\",VLOOKUP(C229,$BQ$3:$BR$15,2,FALSE))","v":""},null,null,null,null,null,null,null,"C",{"$f":"IF(L229=\"\",\"\",VLOOKUP(L229,$BQ$3:$BR$15,2,FALSE))","v":""},null,null,null,null,null,null,null,{"$f":"IF(ISTEXT(I229),1,0)","v":0},{"$f":"IF(ISTEXT(R229),1,0)","v":0}]
["D",{"$f":"IF(C230=\"\",\"\",VLOOKUP(C230,$BQ$3:$BR$15,2,FALSE))","v":""},null,null,null,null,null,null,null,"D",{"$f":"IF(L230=\"\",\"\",VLOOKUP(L230,$BQ$3:$BR$15,2,FALSE))","v":""},null,null,null,null,null,null,null,{"$f":"IF(ISTEXT(I230),1,0)","v":0},{"$f":"IF(ISTEXT(R230),1,0)","v":0}]
[]
[{"$f":"IF(SUM(R227:R230)>0,\"Classement Final : \",\"Classement 1er jour : \")","v":"Classement 1er jour : "},null,null,{"$f":"IF(COUNT(I227:I230)<3,\"\",VLOOKUP(F225,'Cl.J1+Gen.'!$Z$11:$AV$36,23,FALSE))","v":""},{"$f":"IF(SUM(R227:R230)>0,\"Total des 2 Tours : \",\"Total 1er Tour : \")","v":"Total 1er Tour : "},null,{"$f":"IF(OR(I232=\"DIS\",R232=\"DIS\"),\"DIS\",I232+R232)","v":0},null,{"$f":"IF(S232>1,\"DIS\",IF(S232=1,SUM(I227:I230),IF(COUNT(I227:I230)<4,SUM(I227:I230),SUM(I227:I230)-MAX(I227:I230))))","v":0},null,null,null,null,null,null,null,null,{"$f":"IF(T232>1,\"DIS\",IF(T232=1,SUM(R227:R230),IF(COUNT(R227:R230)<$R$2,SUM(R227:R230),SUM(R227:R230)-MAX(R227:R230))))","v":0},{"$f":"SUM(S227:S230)","v":0},{"$f":"SUM(T227:T230)","v":0}]
[]
[null,null,"Equipières du club de :",null,null,{"$f":"Prépa!D61","v":0}]
[null,"Ind","Joueuses de la 1ère Journée",null,null,null,null,null,"Tour 1",null,"Ind","Joueuses de la 2ème Journée",null,null,null,null,null,"Tour 2","FOR ABN DIS","FOR ABN DIS"]
["A",{"$f":"IF(C236=\"\",\"\",VLOOKUP(C236,$BS$3:$BT$15,2,FALSE))","v":""},null,null,null,null,null,null,null,"A",{"$f":"IF(L236=\"\",\"\",VLOOKUP(L236,$BS$3:$BT$15,2,FALSE))","v":""},null,null,null,null,null,null,null,{"$f":"IF(ISTEXT(I236),1,0)","v":0},{"$f":"IF(ISTEXT(R236),1,0)","v":0}]
["B",{"$f":"IF(C237=\"\",\"\",VLOOKUP(C237,$BS$3:$BT$15,2,FALSE))","v":""},null,null,null,null,null,null,null,"B",{"$f":"IF(L237=\"\",\"\",VLOOKUP(L237,$BS$3:$BT$15,2,FALSE))","v":""},null,null,null,null,null,null,null,{"$f":"IF(ISTEXT(I237),1,0)","v":0},{"$f":"IF(ISTEXT(R237),1,0)","v":0}]
["C",{"$f":"IF(C238=\"\",\"\",VLOOKUP(C238,$BS$3:$BT$15,2,FALSE))","v":""},null,null,null,null,null,null,null,"C",{"$f":"IF(L238=\"\",\"\",VLOOKUP(L238,$BS$3:$BT$15,2,FALSE))","v":""},null,null,null,null,null,null,null,{"$f":"IF(ISTEXT(I238),1,0)","v":0},{"$f":"IF(ISTEXT(R238),1,0)","v":0}]
["D",{"$f":"IF(C239=\"\",\"\",VLOOKUP(C239,$BS$3:$BT$15,2,FALSE))","v":""},null,null,null,null,null,null,null,"D",{"$f":"IF(L239=\"\",\"\",VLOOKUP(L239,$BS$3:$BT$15,2,FALSE))","v":""},null,null,null,null,null,null,null,{"$f":"IF(ISTEXT(I239),1,0)","v":0},{"$f":"IF(ISTEXT(R239),1,0)","v":0}]
[]
[{"$f":"IF(SUM(R236:R239)>0,\"Classement Final : \",\"Classement 1er jour : \")","v":"Classement 1er jour : "},null,null,{"$f":"IF(COUNT(I236:I239)<3,\"\",VLOOKUP(F234,'Cl.J1+Gen.'!$Z$11:$AV$36,23,FALSE))","v":""},{"$f":"IF(SUM(R236:R239)>0,\"Total des 2 Tours : \",\"Total 1er Tour : \")","v":"Total 1er Tour : "},null,{"$f":"IF(OR(I241=\"DIS\",R241=\"DIS\"),\"DIS\",I241+R241)","v":0},null,{"$f":"IF(S241>1,\"DIS\",IF(S241=1,SUM(I236:I239),IF(COUNT(I236:I239)<4,SUM(I236:I239),SUM(I236:I239)-MAX(I236:I239))))","v":0},null,null,null,null,null,null,null,null,{"$f":"IF(T241>1,\"DIS\",IF(T241=1,SUM(R236:R239),IF(COUNT(R236:R239)<$R$2,SUM(R236:R239),SUM(R236:R239)-MAX(R236:R239))))","v":0},{"$f":"SUM(S236:S239)","v":0},{"$f":"SUM(T236:T239)","v":0}]

{"sheet":"Cl.J1+Gen.","index":4,"n_rows":36,"n_cols":48,"rows_kept":36,"cut":false,"hidden":false,"merged":[[8,0,9,0],[8,7,9,7],[8,13,9,13],[8,23,9,23],[8,15,9,15],[8,16,9,16],[8,18,9,18],[8,17,9,17],[8,1,9,2],[6,4,6,15],[8,3,8,6],[8,9,8,12],[8,8,9,8],[8,14,9,14]]}
["CETTE FEUILLE SE REMPLIT AUTOMATIQUEMENT AVEC LES INFORMATIONS DES FEUILLES \"Tour1\" ET \"Tour2\".VOUS POUVEZ, SI NECESSAIRE, FAIRE APPARAITRE  OU MASQUER LES DEPARTAGES EN CLIQUANT SUR LES BOUTONS CONCERNES",null,null,null,null,null,null,null,null,null,null,null,null,null,null,null,null,null,null,null,null,null,null,null,null,{"$f":"Prépa!E8","v":3}]
[null,null,{"$f":"Prépa!D2","v":"INTERCLUBS PAR EQUIPES PROMOTION MID DAMES"}]
[null,null,{"$f":"Prépa!D4","v":"Inter régions  OUEST"}]
[]
[null,null,{"$f":"Prépa!D6","v":"19 et 20 juin 2021 au Golf de Saint Cast"}]
[]
[null,null,null,null,"TABLEAU DE RESULTATS"]
[null,null,null,null,null,null,null,null,null,null,null,null,null,null,{"$f":"Donnees!$R$2","v":"e"}]
["Rang","CLUB",null,"JOUEUSES 1er JOUR",null,null,null,"Score Jour 1","DIS","JOUEUSES 2ème JOUR",null,null,null,"Score Jour 2","DIS","TOTAL","1er Dép.","2ème Dép.","3ème Dép.",null,null,null,null,"Rang"]
[null,null,null,"A","B","C","D",null,null,"A","B","C","D"]
[1,{"$f":"Donnees!$F$117","v":"SAINT CAST"},null,{"$f":"Donnees!$I$119","v":75},{"$f":"Donnees!$I$120","v":74},{"$f":"Donnees!$I$121","v":81},{"$f":"Donnees!$I$122","v":78},{"$f":"Donnees!$I$124","v":227},{"$f":"Donnees!$S$124","v":0},{"$f":"Donnees!$R$119","v":71},{"$f":"Donnees!$R$120","v":69},{"$f":"Donnees!$R$121","v":79},{"$f":"Donnees!$R$122","v":72},{"$f":"Donnees!$R$124","v":212},{"$f":"Donnees!$T$124","v":0},{"$f":"Donnees!$G$124","v":439},{"$f":"IF(OR(I11>0,O11>0),\"DIS\",MAX(D11:G11)+MAX(J11:M11))","v":160},{"$f":"SMALL($D11:$G11,1)+IF($O$8=3,SMALL($J11:$M11,2),SMALL($J11:$M11,1))","v":143},{"$f":"SMALL($D11:$G11,2)+IF($O$8=3,SMALL($J11:$M11,3),SMALL($J11:$M11,2))","v":146},{"$f":"IF(Q11=\"dis\",999,IF(Q11<100,0&Q11,Q11))","v":160},{"$f":"IF(R11=\"dis\",999,IF(R11<100,0&R11,R11))","v":143},{"$f":"IF(S11=\"dis\",999,IF(S11<100,0&S11,S11))","v":146},{"$f":"CONCATENATE(T11,U11,V11,)","v":"160143146"},1,null,"BAUGE",null,86,96,100,101,282,0,83,95,92,101,270,0,552,202,169,188,202,169,188,"202169188",14]
[2,{"$f":"Donnees!$F$108","v":"SABLES D'OR"},null,{"$f":"Donnees!$I$110","v":75},{"$f":"Donnees!$I$111","v":82},{"$f":"Donnees!$I$112","v":88},{"$f":"Donnees!$I$113","v":90},{"$f":"Donnees!$I$115","v":245},{"$f":"Donnees!$S$115","v":0},{"$f":"Donnees!$R$110","v":78},{"$f":"Donnees!$R$111","v":79},{"$f":"Donnees!$R$112","v":75},{"$f":"Donnees!$R$113","v":88},{"$f":"Donnees!$R$115","v":232},{"$f":"Donnees!$T$115","v":0},{"$f":"Donnees!$G$115","v":477},{"$f":"IF(OR(I12>0,O12>0),\"DIS\",MAX(D12:G12)+MAX(J12:M12))","v":178},{"$f":"SMALL($D12:$G12,1)+IF($O$8=3,SMALL($J12:$M12,2),SMALL($J12:$M12,1))","v":150},{"$f":"SMALL($D12:$G12,2)+IF($O$8=3,SMALL($J12:$M12,3),SMALL($J12:$M12,2))","v":160},{"$f":"IF(Q12=\"dis\",999,IF(Q12<100,0&Q12,Q12))","v":178},{"$f":"IF(R12=\"dis\",999,IF(R12<100,0&R12,R12))","v":150},{"$f":"IF(S12=\"dis\",999,IF(S12<100,0&S12,S12))","v":160},{"$f":"CONCATENATE(T12,U12,V12,)","v":"178150160"},2,null,"BOIS D'O",null,89,92,92,98,273,0,87,92,95,92,271,0,544,193,176,184,193,176,184,"193176184",12]
[3,{"$f":"Donnees!$F$81","v":"NANTES ERDRE"},null,{"$f":"Donnees!$I$83","v":76},{"$f":"Donnees!$I$84","v":85},{"$f":"Donnees!$I$85","v":84},{"$f":"Donnees!$I$86","v":95},{"$f":"Donnees!$I$88","v":245},{"$f":"Donnees!$S$88","v":0},{"$f":"Donnees!$R$83","v":77},{"$f":"Donnees!$R$84","v":78},{"$f":"Donnees!$R$85","v":79},{"$f":"Donnees!$R$86","v":83},{"$f":"Donnees!$R$88","v":234},{"$f":"Donnees!$T$88","v":0},{"$f":"Donnees!$G$88","v":479},{"$f":"IF(OR(I13>0,O13>0),\"DIS\",MAX(D13:G13)+MAX(J13:M13))","v":178},{"$f":"SMALL($D13:$G13,1)+IF($O$8=3,SMALL($J13:$M13,2),SMALL($J13:$M13,1))","v":153},{"$f":"SMALL($D13:$G13,2)+IF($O$8=3,SMALL($J13:$M13,3),SMALL($J13:$M13,2))","v":162},{"$f":"IF(Q13=\"dis\",999,IF(Q13<100,0&Q13,Q13))","v":178},{"$f":"IF(R13=\"dis\",999,IF(R13<100,0&R13,R13))","v":153},{"$f":"IF(S13=\"dis\",999,IF(S13<100,0&S13,S13))","v":162},{"$f":"CONCATENATE(T13,U13,V13,)","v":"178153162"},3,null,"CH. CHEVERNY",null,88,78,87,93,253,0,85,77,90,98,252,0,505,191,155,172,191,155,172,"191155172",6]
[4,{"$f":"Donnees!$F$36","v":"CHARTRES FONTENAY"},null,{"$f":"Donnees!$I$38","v":78},{"$f":"Donnees!$I$39","v":78},{"$f":"Donnees!$I$40","v":80},{"$f":"Donnees!$I$41","v":83},{"$f":"Donnees!$I$43","v":236},{"$f":"Donnees!$S$43","v":0},{"$f":"Donnees!$R$38","v":91},{"$f":"Donnees!$R$39","v":75},{"$f":"Donnees!$R$40","v":83},{"$f":"Donnees!$R$41","v":90},{"$f":"Donnees!$R$43","v":248},{"$f":"Donnees!$T$43","v":0},{"$f":"Donnees!$G$43","v":484},{"$f":"IF(OR(I14>0,O14>0),\"DIS\",MAX(D14:G14)+MAX(J14:M14))","v":174},{"$f":"SMALL($D14:$G14,1)+IF($O$8=3,SMALL($J14:$M14,2),SMALL($J14:$M14,1))","v":153},{"$f":"SMALL($D14:$G14,2)+IF($O$8=3,SMALL($J14:$M14,3),SMALL($J14:$M14,2))","v":161},{"$f":"IF(Q14=\"dis\",999,IF(Q14<100,0&Q14,Q14))","v":174},{"$f":"IF(R14=\"dis\",999,IF(R14<100,0&R14,R14))","v":153},{"$f":"IF(S14=\"dis\",999,IF(S14<100,0&S14,S14))","v":161},{"$f":"CONCATENATE(T14,U14,V14,)","v":"174153161"},4,null,"CHARTRES FONTENAY",null,78,78,80,83,236,0,91,75,83,90,248,0,484,174,153,161,174,153,161,"174153161",4]
[5,{"$f":"Donnees!$F$126","v":"SAVENAY"},null,{"$f":"Donnees!$I$128","v":81},{"$f":"Donnees!$I$129","v":88},{"$f":"Donnees!$I$130","v":77},{"$f":"Donnees!$I$131","v":84},{"$f":"Donnees!$I$133","v":242},{"$f":"Donnees!$S$133","v":0},{"$f":"Donnees!$R$128","v":91},{"$f":"Donnees!$R$129","v":78},{"$f":"Donnees!$R$130","v":83},{"$f":"Donnees!$R$131","v":90},{"$f":"Donnees!$R$133","v":251},{"$f":"Donnees!$T$133","v":0},{"$f":"Donnees!$G$133","v":493},{"$f":"IF(OR(I15>0,O15>0),\"DIS\",MAX(D15:G15)+MAX(J15:M15))","v":179},{"$f":"SMALL($D15:$G15,1)+IF($O$8=3,SMALL($J15:$M15,2),SMALL($J15:$M15,1))","v":155},{"$f":"SMALL($D15:$G15,2)+IF($O$8=3,SMALL($J15:$M15,3),SMALL($J15:$M15,2))","v":164},{"$f":"IF(Q15=\"dis\",999,IF(Q15<100,0&Q15,Q15))","v":179},{"$f":"IF(R15=\"dis\",999,IF(R15<100,0&R15,R15))","v":155},{"$f":"IF(S15=\"dis\",999,IF(S15<100,0&S15,S15))","v":164},{"$f":"CONCATENATE(T15,U15,V15,)","v":"179155164"},5,null,"CHOLET",null,89,85,88,96,262,0,82,99,84,93,259,0,521,195,167,172,195,167,172,"195167172",10]
[6,{"$f":"Donnees!$F$27","v":"CH. CHEVERNY"},null,{"$f":"Donnees!$I$29","v":88},{"$f":"Donnees!$I$30","v":78},{"$f":"Donnees!$I$31","v":87},{"$f":"Donnees!$I$32","v":93},{"$f":"Donnees!$I$34","v":253},{"$f":"Donnees!$S$34","v":0},{"$f":"Donnees!$R$29","v":85},{"$f":"Donnees!$R$30","v":77},{"$f":"Donnees!$R$31","v":90},{"$f":"Donnees!$R$32","v":98},{"$f":"Donnees!$R$34","v":252},{"$f":"Donnees!$T$34","v":0},{"$f":"Donnees!$G$34","v":505},{"$f":"IF(OR(I16>0,O16>0),\"DIS\",MAX(D16:G16)+MAX(J16:M16))","v":191},{"$f":"SMALL($D16:$G16,1)+IF($O$8=3,SMALL($J16:$M16,2),SMALL($J16:$M16,1))","v":155},{"$f":"SMALL($D16:$G16,2)+IF($O$8=3,SMALL($J16:$M16,3),SMALL($J16:$M16,2))","v":172},{"$f":"IF(Q16=\"dis\",999,IF(Q16<100,0&Q16,Q16))","v":191},{"$f":"IF(R16=\"dis\",999,IF(R16<100,0&R16,R16))","v":155},{"$f":"IF(S16=\"dis\",999,IF(S16<100,0&S16,S16))","v":172},{"$f":"CONCATENATE(T16,U16,V16,)","v":"191155172"},6,null,"GLORIETTE",null,97,82,95,103,274,0,83,89,96,92,264,0,538,199,165,184,199,165,184,"199165184",11]
[7,{"$f":"Donnees!$F$72","v":"LAVAL"},null,{"$f":"Donnees!$I$74","v":75},{"$f":"Donnees!$I$75","v":89},{"$f":"Donnees!$I$76","v":94},{"$f":"Donnees!$I$77","v":93},{"$f":"Donnees!$I$79","v":257},{"$f":"Donnees!$S$79","v":0},{"$f":"Donnees!$R$74","v":81},{"$f":"Donnees!$R$75","v":82},{"$f":"Donnees!$R$76","v":96},{"$f":"Donnees!$R$77","v":91},{"$f":"Donnees!$R$79","v":254},{"$f":"Donnees!$T$79","v":0},{"$f":"Donnees!$G$79","v":511},{"$f":"IF(OR(I17>0,O17>0),\"DIS\",MAX(D17:G17)+MAX(J17:M17))","v":190},{"$f":"SMALL($D17:$G17,1)+IF($O$8=3,SMALL($J17:$M17,2),SMALL($J17:$M17,1))","v":156},{"$f":"SMALL($D17:$G17,2)+IF($O$8=3,SMALL($J17:$M17,3),SMALL($J17:$M17,2))","v":171},{"$f":"IF(Q17=\"dis\",999,IF(Q17<100,0&Q17,Q17))","v":190},{"$f":"IF(R17=\"dis\",999,IF(R17<100,0&R17,R17))","v":156},{"$f":"IF(S17=\"dis\",999,IF(S17<100,0&S17,S17))","v":171},{"$f":"CONCATENATE(T17,U17,V17,)","v":"190156171"},7,null,"LAC AU DUC",null,77,96,93,90,260,0,73,89,89,97,251,0,511,193,150,179,193,150,179,"193150179",8]
[8,{"$f":"Donnees!$F$63","v":"LAC AU DUC"},null,{"$f":"Donnees!$I$65","v":77},{"$f":"Donnees!$I$66","v":96},{"$f":"Donnees!$I$67","v":93},{"$f":"Donnees!$I$68","v":90},{"$f":"Donnees!$I$70","v":260},{"$f":"Donnees!$S$70","v":0},{"$f":"Donnees!$R$65","v":73},{"$f":"Donnees!$R$66","v":89},{"$f":"Donnees!$R$67","v":89},{"$f":"Donnees!$R$68","v":97},{"$f":"Donnees!$R$70","v":251},{"$f":"Donnees!$T$70","v":0},{"$f":"Donnees!$G$70","v":511},{"$f":"IF(OR(I18>0,O18>0),\"DIS\",MAX(D18:G18)+MAX(J18:M18))","v":193},{"$f":"SMALL($D18:$G18,1)+IF($O$8=3,SMALL($J18:$M18,2),SMALL($J18:$M18,1))","v":150},{"$f":"SMALL($D18:$G18,2)+IF($O$8=3,SMALL($J18:$M18,3),SMALL($J18:$M18,2))","v":179},{"$f":"IF(Q18=\"dis\",999,IF(Q18<100,0&Q18,Q18))","v":193},{"$f":"IF(R18=\"dis\",999,IF(R18<100,0&R18,R18))","v":150},{"$f":"IF(S18=\"dis\",999,IF(S18<100,0&S18,S18))","v":179},{"$f":"CONCATENATE(T18,U18,V18,)","v":"193150179"},8,null,"LAVAL",null,75,89,94,93,257,0,81,82,96,91,254,0,511,190,156,171,190,156,171,"190156171",7]
[9,{"$f":"Donnees!$F$90","v":"ORLEANS DONNERY"},null,{"$f":"Donnees!$I$92","v":85},{"$f":"Donnees!$I$93","v":99},{"$f":"Donnees!$I$94","v":92},{"$f":"Donnees!$I$95","v":90},{"$f":"Donnees!$I$97","v":267},{"$f":"Donnees!$S$97","v":0},{"$f":"Donnees!$R$92","v":84},{"$f":"Donnees!$R$93","v":89},{"$f":"Donnees!$R$94","v":78},{"$f":"Donnees!$R$95","v":95},{"$f":"Donnees!$R$97","v":251},{"$f":"Donnees!$T$97","v":0},{"$f":"Donnees!$G$97","v":518},{"$f":"IF(OR(I19>0,O19>0),\"DIS\",MAX(D19:G19)+MAX(J19:M19))","v":194},{"$f":"SMALL($D19:$G19,1)+IF($O$8=3,SMALL($J19:$M19,2),SMALL($J19:$M19,1))","v":163},{"$f":"SMALL($D19:$G19,2)+IF($O$8=3,SMALL($J19:$M19,3),SMALL($J19:$M19,2))","v":174},{"$f":"IF(Q19=\"dis\",999,IF(Q19<100,0&Q19,Q19))","v":194},{"$f":"IF(R19=\"dis\",999,IF(R19<100,0&R19,R19))","v":163},{"$f":"IF(S19=\"dis\",999,IF(S19<100,0&S19,S19))","v":174},{"$f":"CONCATENATE(T19,U19,V19,)","v":"194163174"},9,null,"NANTES ERDRE",null,76,85,84,95,245,0,77,78,79,83,234,0,479,178,153,162,178,153,162,"178153162",3]
[10,{"$f":"Donnees!$F$45","v":"CHOLET"},null,{"$f":"Donnees!$I$47","v":89},{"$f":"Donnees!$I$48","v":85},{"$f":"Donnees!$I$49","v":88},{"$f":"Donnees!$I$50","v":96},{"$f":"Donnees!$I$52","v":262},{"$f":"Donnees!$S$52","v":0},{"$f":"Donnees!$R$47","v":82},{"$f":"Donnees!$R$48","v":99},{"$f":"Donnees!$R$49","v":84},{"$f":"Donnees!$R$50","v":93},{"$f":"Donnees!$R$52","v":259},{"$f":"Donnees!$T$52","v":0},{"$f":"Donnees!$G$52","v":521},{"$f":"IF(OR(I20>0,O20>0),\"DIS\",MAX(D20:G20)+MAX(J20:M20))","v":195},{"$f":"SMALL($D20:$G20,1)+IF($O$8=3,SMALL($J20:$M20,2),SMALL($J20:$M20,1))","v":167},{"$f":"SMALL($D20:$G20,2)+IF($O$8=3,SMALL($J20:$M20,3),SMALL($J20:$M20,2))","v":172},{"$f":"IF(Q20=\"dis\",999,IF(Q20<100,0&Q20,Q20))","v":195},{"$f":"IF(R20=\"dis\",999,IF(R20<100,0&R20,R20))","v":167},{"$f":"IF(S20=\"dis\",999,IF(S20<100,0&S20,S20))","v":172},{"$f":"CONCATENATE(T20,U20,V20,)","v":"195167172"},10,null,"ORLEANS DONNERY",null,85,99,92,90,267,0,84,89,78,95,251,0,518,194,163,174,194,163,174,"194163174",9]
[11,{"$f":"Donnees!$F$54","v":"GLORIETTE"},null,{"$f":"Donnees!$I$56","v":97},{"$f":"Donnees!$I$57","v":82},{"$f":"Donnees!$I$58","v":95},{"$f":"Donnees!$I$59","v":103},{"$f":"Donnees!$I$61","v":274},{"$f":"Donnees!$S$61","v":0},{"$f":"Donnees!$R$56","v":83},{"$f":"Donnees!$R$57","v":89},{"$f":"Donnees!$R$58","v":96},{"$f":"Donnees!$R$59","v":92},{"$f":"Donnees!$R$61","v":264},{"$f":"Donnees!$T$61","v":0},{"$f":"Donnees!$G$61","v":538},{"$f":"IF(OR(I21>0,O21>0),\"DIS\",MAX(D21:G21)+MAX(J21:M21))","v":199},{"$f":"SMALL($D21:$G21,1)+IF($O$8=3,SMALL($J21:$M21,2),SMALL($J21:$M21,1))","v":165},{"$f":"SMALL($D21:$G21,2)+IF($O$8=3,SMALL($J21:$M21,3),SMALL($J21:$M21,2))","v":184},{"$f":"IF(Q21=\"dis\",999,IF(Q21<100,0&Q21,Q21))","v":199},{"$f":"IF(R21=\"dis\",999,IF(R21<100,0&R21,R21))","v":165},{"$f":"IF(S21=\"dis\",999,IF(S21<100,0&S21,S21))","v":184},{"$f":"CONCATENATE(T21,U21,V21,)","v":"199165184"},11,null,"PLENEUF VAL ANDRE",null,94,87,100,97,278,0,93,95,84,89,266,0,544,195,171,183,195,171,183,"195171183",13]
[12,{"$f":"Donnees!$F$18","v":"BOIS D'O"},null,{"$f":"Donnees!$I$20","v":89},{"$f":"Donnees!$I$21","v":92},{"$f":"Donnees!$I$22","v":92},{"$f":"Donnees!$I$23","v":98},{"$f":"Donnees!$I$25","v":273},{"$f":"Donnees!$S$25","v":0},{"$f":"Donnees!$R$20","v":87},{"$f":"Donnees!$R$21","v":92},{"$f":"Donnees!$R$22","v":95},{"$f":"Donnees!$R$23","v":92},{"$f":"Donnees!$R$25","v":271},{"$f":"Donnees!$T$25","v":0},{"$f":"Donnees!$G$25","v":544},{"$f":"IF(OR(I22>0,O22>0),\"DIS\",MAX(D22:G22)+MAX(J22:M22))","v":193},{"$f":"SMALL($D22:$G22,1)+IF($O$8=3,SMALL($J22:$M22,2),SMALL($J22:$M22,1))","v":176},{"$f":"SMALL($D22:$G22,2)+IF($O$8=3,SMALL($J22:$M22,3),SMALL($J22:$M22,2))","v":184},{"$f":"IF(Q22=\"dis\",999,IF(Q22<100,0&Q22,Q22))","v":193},{"$f":"IF(R22=\"dis\",999,IF(R22<100,0&R22,R22))","v":176},{"$f":"IF(S22=\"dis\",999,IF(S22<100,0&S22,S22))","v":184},{"$f":"CONCATENATE(T22,U22,V22,)","v":"193176184"},12,null,"SABLES D'OR",null,75,82,88,90,245,0,78,79,75,88,232,0,477,178,150,160,178,150,160,"178150160",2]
[13,{"$f":"Donnees!$F$99","v":"PLENEUF VAL ANDRE"},null,{"$f":"Donnees!$I$101","v":94},{"$f":"Donnees!$I$102","v":87},{"$f":"Donnees!$I$103","v":100},{"$f":"Donnees!$I$104","v":97},{"$f":"Donnees!$I$106","v":278},{"$f":"Donnees!$S$106","v":0},{"$f":"Donnees!$R$101","v":93},{"$f":"Donnees!$R$102","v":95},{"$f":"Donnees!$R$103","v":84},{"$f":"Donnees!$R$104","v":89},{"$f":"Donnees!$R$106","v":266},{"$f":"Donnees!$T$106","v":0},{"$f":"Donnees!$G$106","v":544},{"$f":"IF(OR(I23>0,O23>0),\"DIS\",MAX(D23:G23)+MAX(J23:M23))","v":195},{"$f":"SMALL($D23:$G23,1)+IF($O$8=3,SMALL($J23:$M23,2),SMALL($J23:$M23,1))","v":171},{"$f":"SMALL($D23:$G23,2)+IF($O$8=3,SMALL($J23:$M23,3),SMALL($J23:$M23,2))","v":183},{"$f":"IF(Q23=\"dis\",999,IF(Q23<100,0&Q23,Q23))","v":195},{"$f":"IF(R23=\"dis\",999,IF(R23<100,0&R23,R23))","v":171},{"$f":"IF(S23=\"dis\",999,IF(S23<100,0&S23,S23))","v":183},{"$f":"CONCATENATE(T23,U23,V23,)","v":"195171183"},13,null,"SAINT CAST",null,75,74,81,78,227,0,71,69,79,72,212,0,439,160,143,146,160,143,146,"160143146",1]
[14,{"$f":"Donnees!$F$9","v":"BAUGE"},null,{"$f":"Donnees!$I$11","v":86},{"$f":"Donnees!$I$12","v":96},{"$f":"Donnees!$I$13","v":100},{"$f":"Donnees!$I$14","v":101},{"$f":"Donnees!$I$16","v":282},{"$f":"Donnees!$S$16","v":0},{"$f":"Donnees!$R$11","v":83},{"$f":"Donnees!$R$12","v":95},{"$f":"Donnees!$R$13","v":92},{"$f":"Donnees!$R$14","v":101},{"$f":"Donnees!$R$16","v":270},{"$f":"Donnees!$T$16","v":0},{"$f":"Donnees!$G$16","v":552},{"$f":"IF(OR(I24>0,O24>0),\"DIS\",MAX(D24:G24)+MAX(J24:M24))","v":202},{"$f":"SMALL($D24:$G24,1)+IF($O$8=3,SMALL($J24:$M24,2),SMALL($J24:$M24,1))","v":169},{"$f":"SMALL($D24:$G24,2)+IF($O$8=3,SMALL($J24:$M24,3),SMALL($J24:$M24,2))","v":188},{"$f":"IF(Q24=\"dis\",999,IF(Q24<100,0&Q24,Q24))","v":202},{"$f":"IF(R24=\"dis\",999,IF(R24<100,0&R24,R24))","v":169},{"$f":"IF(S24=\"dis\",999,IF(S24<100,0&S24,S24))","v":188},{"$f":"CONCATENATE(T24,U24,V24,)","v":"202169188"},14,null,"SAVENAY",null,81,88,77,84,242,0,91,78,83,90,251,0,493,179,155,164,179,155,164,"179155164",5]
[15,{"$f":"Donnees!$F$135","v":0},null,{"$f":"Donnees!$I$137","v":0},{"$f":"Donnees!$I$138","v":0},{"$f":"Donnees!$I$139","v":0},{"$f":"Donnees!$I$140","v":0},{"$f":"Donnees!$I$142","v":0},{"$f":"Donnees!$S$142","v":0},{"$f":"Donnees!$R$137","v":0},{"$f":"Donnees!$R$138","v":0},{"$f":"Donnees!$R$139","v":0},{"$f":"Donnees!$R$140","v":0},{"$f":"Donnees!$R$142","v":0},{"$f":"Donnees!$T$142","v":0},{"$f":"Donnees!$G$142","v":0},{"$f":"IF(OR(I25>0,O25>0),\"DIS\",MAX(D25:G25)+MAX(J25:M25))","v":0},{"$f":"SMALL($D25:$G25,1)+IF($O$8=3,SMALL($J25:$M25,2),SMALL($J25:$M25,1))","v":0},{"$f":"SMALL($D25:$G25,2)+IF($O$8=3,SMALL($J25:$M25,3),SMALL($J25:$M25,2))","v":0},{"$f":"IF(Q25=\"dis\",999,IF(Q25<100,0&Q25,Q25))","v":"00"},{"$f":"IF(R25=\"dis\",999,IF(R25<100,0&R25,R25))","v":"00"},{"$f":"IF(S25=\"dis\",999,IF(S25<100,0&S25,S25))","v":"00"},{"$f":"CONCATENATE(T25,U25,V25,)","v":"000000"},15,null,0,null,0,0,0,0,0,0,0,0,0,0,0,0,0,0,0,0,"00","00","00","000000",15]
[16,{"$f":"Donnees!$F$144","v":0},null,{"$f":"Donnees!$I$146","v":0},{"$f":"Donnees!$I$147","v":0},{"$f":"Donnees!$I$148","v":0},{"$f":"Donnees!$I$149","v":0},{"$f":"Donnees!$I$151","v":0},{"$f":"Donnees!$S$151","v":0},{"$f":"Donnees!$R$146","v":0},{"$f":"Donnees!$R$147","v":0},{"$f":"Donnees!$R$148","v":0},{"$f":"Donnees!$R$149","v":0},{"$f":"Donnees!$R$151","v":0},{"$f":"Donnees!$T$151","v":0},{"$f":"Donnees!$G$151","v":0},0,0,0,"00","00","00","000000",16,null,0,null,0,0,0,0,0,0,0,0,0,0,0,0,0,0,0,0,"00","00","00","000000",16]
[17,{"$f":"Donnees!$F$153","v":0},null,{"$f":"Donnees!$I$155","v":0},{"$f":"Donnees!$I$156","v":0},{"$f":"Donnees!$I$157","v":0},{"$f":"Donnees!$I$158","v":0},{"$f":"Donnees!$I$160","v":0},{"$f":"Donnees!$S$160","v":0},{"$f":"Donnees!$R$155","v":0},{"$f":"Donnees!$R$156","v":0},{"$f":"Donnees!$R$157","v":0},{"$f":"Donnees!$R$158","v":0},{"$f":"Donnees!$R$160","v":0},{"$f":"Donnees!$T$160","v":0},{"$f":"Donnees!$G$160","v":0},0,0,0,"00","00","00","000000",17,null,0,null,0,0,0,0,0,0,0,0,0,0,0,0,0,0,0,0,"00","00","00","000000",17]
[18,{"$f":"Donnees!$F$162","v":0},null,{"$f":"Donnees!$I$164","v":0},{"$f":"Donnees!$I$165","v":0},{"$f":"Donnees!$I$166","v":0},{"$f":"Donnees!$I$167","v":0},{"$f":"Donnees!$I$169","v":0},{"$f":"Donnees!$S$169","v":0},{"$f":"Donnees!$R$164","v":0},{"$f":"Donnees!$R$165","v":0},{"$f":"Donnees!$R$166","v":0},{"$f":"Donnees!$R$167","v":0},{"$f":"Donnees!$R$169","v":0},{"$f":"Donnees!$T$169","v":0},{"$f":"Donnees!$G$169","v":0},0,0,0,"00","00","00","000000",18,null,0,null,0,0,0,0,0,0,0,0,0,0,0,0,0,0,0,0,"00","00","00","000000",18]
[19,{"$f":"Donnees!$F$171","v":0},null,{"$f":"Donnees!$I$173","v":0},{"$f":"Donnees!$I$174","v":0},{"$f":"Donnees!$I$175","v":0},{"$f":"Donnees!$I$176","v":0},{"$f":"Donnees!$I$178","v":0},{"$f":"Donnees!$S$178","v":0},{"$f":"Donnees!$R$173","v":0},{"$f":"Donnees!$R$174","v":0},{"$f":"Donnees!$R$175","v":0},{"$f":"Donnees!$R$176","v":0},{"$f":"Donnees!$R$178","v":0},{"$f":"Donnees!$T$178","v":0},{"$f":"Donnees!$G$178","v":0},0,0,0,"00","00","00","000000",19,null,0,null,0,0,0,0,0,0,0,0,0,0,0,0,0,0,0,0,"00","00","00","000000",19]
[20,{"$f":"Donnees!$F$180","v":0},null,{"$f":"Donnees!$I$182","v":0},{"$f":"Donnees!$I$183","v":0},{"$f":"Donnees!$I$184","v":0},{"$f":"Donnees!$I$185","v":0},{"$f":"Donnees!$I$187","v":0},{"$f":"Donnees!$S$187","v":0},{"$f":"Donnees!$R$182","v":0},{"$f":"Donnees!$R$183","v":0},{"$f":"Donnees!$R$184","v":0},{"$f":"Donnees!$R$185","v":0},{"$f":"Donnees!$R$187","v":0},{"$f":"Donnees!$T$187","v":0},{"$f":"Donnees!$G$187","v":0},0,0,0,"00","00","00","000000",20,null,0,null,0,0,0,0,0,0,0,0,0,0,0,0,0,0,0,0,"00","00","00","000000",20]
[21,{"$f":"Donnees!$F$189","v":0},null,{"$f":"Donnees!$I$191","v":0},{"$f":"Donnees!$I$192","v":0},{"$f":"Donnees!$I$193","v":0},{"$f":"Donnees!$I$194","v":0},{"$f":"Donnees!$I$196","v":0},{"$f":"Donnees!$S$196","v":0},{"$f":"Donnees!$R$191","v":0},{"$f":"Donnees!$R$192","v":0},{"$f":"Donnees!$R$193","v":0},{"$f":"Donnees!$R$194","v":0},{"$f":"Donnees!$R$196","v":0},{"$f":"Donnees!$T$196","v":0},{"$f":"Donnees!$G$196","v":0},0,0,0,"00","00","00","000000",21,null,0,null,0,0,0,0,0,0,0,0,0,0,0,0,0,0,0,0,"00","00","00","000000",21]
[22,{"$f":"Donnees!$F$198","v":0},null,{"$f":"Donnees!$I$200","v":0},{"$f":"Donnees!$I$201","v":0},{"$f":"Donnees!$I$202","v":0},{"$f":"Donnees!$I$203","v":0},{"$f":"Donnees!$I$205","v":0},{"$f":"Donnees!$S$205","v":0},{"$f":"Donnees!$R$200","v":0},{"$f":"Donnees!$R$201","v":0},{"$f":"Donnees!$R$202","v":0},{"$f":"Donnees!$R$203","v":0},{"$f":"Donnees!$R$205","v":0},{"$f":"Donnees!$T$205","v":0},{"$f":"Donnees!$G$205","v":0},0,0,0,"00","00","00","000000",22,null,0,null,0,0,0,0,0,0,0,0,0,0,0,0,0,0,0,0,"00","00","00","000000",22]
[23,{"$f":"Donnees!$F$207","v":0},null,{"$f":"Donnees!$I$209","v":0},{"$f":"Donnees!$I$210","v":0},{"$f":"Donnees!$I$211","v":0},{"$f":"Donnees!$I$212","v":0},{"$f":"Donnees!$I$214","v":0},{"$f":"Donnees!$S$214","v":0},{"$f":"Donnees!$R$209","v":0},{"$f":"Donnees!$R$210","v":0},{"$f":"Donnees!$R$211","v":0},{"$f":"Donnees!$R$212","v":0},{"$f":"Donnees!$R$214","v":0},{"$f":"Donnees!$T$214","v":0},{"$f":"Donnees!$G$214","v":0},0,0,0,"00","00","00","000000",23,null,0,null,0,0,0,0,0,0,0,0,0,0,0,0,0,0,0,0,"00","00","00","000000",23]
[24,{"$f":"Donnees!$F$216","v":0},null,{"$f":"Donnees!$I$218","v":0},{"$f":"Donnees!$I$219","v":0},{"$f":"Donnees!$I$220","v":0},{"$f":"Donnees!$I$221","v":0},{"$f":"Donnees!$I$223","v":0},{"$f":"Donnees!$S$223","v":0},{"$f":"Donnees!$R$218","v":0},{"$f":"Donnees!$R$219","v":0},{"$f":"Donnees!$R$220","v":0},{"$f":"Donnees!$R$221","v":0},{"$f":"Donnees!$R$223","v":0},{"$f":"Donnees!$T$223","v":0},{"$f":"Donnees!$G$223","v":0},0,0,0,"00","00","00","000000",24,null,0,null,0,0,0,0,0,0,0,0,0,0,0,0,0,0,0,0,"00","00","00","000000",24]
[25,{"$f":"Donnees!$F$225","v":0},null,{"$f":"Donnees!$I$227","v":0},{"$f":"Donnees!$I$228","v":0},{"$f":"Donnees!$I$229","v":0},{"$f":"Donnees!$I$230","v":0},{"$f":"Donnees!$I$232","v":0},{"$f":"Donnees!$S$232","v":0},{"$f":"Donnees!$R$227","v":0},{"$f":"Donnees!$R$228","v":0},{"$f":"Donnees!$R$229","v":0},{"$f":"Donnees!$R$230","v":0},{"$f":"Donnees!$R$232","v":0},{"$f":"Donnees!$T$232","v":0},{"$f":"Donnees!$G$232","v":0},0,0,0,"00","00","00","000000",25,null,0,null,0,0,0,0,0,0,0,0,0,0,0,0,0,0,0,0,"00","00","00","000000",25]
[26,{"$f":"Donnees!$F$234","v":0},null,{"$f":"Donnees!$I$236","v":0},{"$f":"Donnees!$I$237","v":0},{"$f":"Donnees!$I$238","v":0},{"$f":"Donnees!$I$239","v":0},{"$f":"Donnees!$I$241","v":0},{"$f":"Donnees!$S$241","v":0},{"$f":"Donnees!$R$236","v":0},{"$f":"Donnees!$R$237","v":0},{"$f":"Donnees!$R$238","v":0},{"$f":"Donnees!$R$239","v":0},{"$f":"Donnees!$R$241","v":0},{"$f":"Donnees!$T$241","v":0},{"$f":"Donnees!$G$241","v":0},0,0,0,"00","00","00","000000",26,null,0,null,0,0,0,0,0,0,0,0,0,0,0,0,0,0,0,0,"00","00","00","000000",26]